Unit tests (1/2)
took 1m 53s Raw logs
Matrix: shard: 1
Failed at Unit tests
Process completed with exit code 1.
containers/runner test: [90m 32|[39m [35mawait[39m api[33m.[39m[34mclose[39m()[33m;[39m
containers/runner test: [90m 33|[39m // Containers may leave root-owned files behind; clean up through Do…
containers/runner test: [90m 34|[39m if (dockerWorks()) execFileSync("docker", ["run", "--rm", "-v", `${w…
containers/runner test: [90m |[39m [31m^[39m
containers/runner test: [90m 35|[39m [34mrmSync[39m(workRoot[33m,[39m { recursive[33m:[39m [35mtrue[39m[33m,[39m force[33m:[39m [35mtrue[39m })[33m;[39m
containers/runner test: [90m 36|[39m })[33m;[39m
containers/runner test: [31m[2m⎯⎯⎯⎯⎯⎯⎯⎯⎯⎯⎯⎯⎯⎯⎯⎯⎯⎯⎯⎯⎯⎯⎯⎯[4/4]⎯[22m[39m
containers/runner test: [2m Test Files [22m [1m[31m1 failed[39m[22m[2m | [22m[1m[32m4 passed[39m[22m[90m (5)[39m
containers/runner test: [2m Tests [22m [1m[31m2 failed[39m[22m[2m | [22m[1m[32m36 passed[39m[22m[90m (38)[39m
containers/runner test: [2m Start at [22m 15:01:45
containers/runner test: [2m Duration [22m 44.90s[2m (transform 3.19s, setup 0ms, import 9.84s, tests 48.17s, environment 6ms)[22m
containers/runner test: ::error file=/workspace/diffinery/containers/runner/test/docker.test.ts,title=test/docker.test.ts > docker > runs steps and JavaScript actions in a job container next to a service container,line=85,column=31::AssertionError: Diffinery runner: job build (build) for acme/widgets@0123456789ab%0ARunner: in lhr14, WEUR, container 93493a3945af99a6d38aaed0fce6a9ef4dd5fcded68dc9b190dadf88bec0883f%0AWorkspace: /tmp/runner-test-09Ge6q/widgets%0A##[group]Initialize containers%0ADocker 29.9.1%0Ad150d89bc5026c6f739997cd1b5b17f4ee56df64dbae1aed87d1dc857a38ac71%0A##[command]docker pull mirror.gcr.io/library/redis:7-alpine%0A7-alpine: Pulling from library/redis%0A4eb14bae0e1d: Pulling fs layer%0A83234986c742: Pulling fs layer%0A16333ee0c00f: Pulling fs layer%0A1522f9c6f453: Pulling fs layer%0A7eb50503c2b0: Pulling fs layer%0A9928009b15c8: Pulling fs layer%0A4f4fb700ef54: Pulling fs layer%0A83234986c742: Download complete%0Afailed to copy: httpReadSeeker: failed open: could not fetch content descriptor sha256:54779914f171bfa38f26af5e1917062c78d4f03656ae17bc1320b357838f151c (application/vnd.in-toto+json) from remote: not found%0A##[endgroup]%0A##[error]Could not pull mirror.gcr.io/library/redis:7-alpine (docker pull exited with 1).%0AJob completed with conclusion: failure: expected 'failure' to be 'success' // Object.is equality%0A%0AExpected: "success"%0AReceived: "failure"%0A%0A ❯ test/docker.test.ts:85:31%0A%0A
containers/runner test: ::error file=/workspace/diffinery/containers/runner/test/docker.test.ts,title=test/docker.test.ts > docker > runs steps and JavaScript actions in a job container next to a service container,line=34,column=22::Error: Command failed: docker run --rm -v /tmp/runner-test-09Ge6q:/w mirror.gcr.io/library/alpine:3.20 sh -c rm -rf /w/* /w/.[!.]*%0A ❯ test/docker.test.ts:34:22%0A%0A⎯⎯⎯⎯⎯⎯⎯⎯⎯⎯⎯⎯⎯⎯⎯⎯⎯⎯⎯⎯⎯⎯⎯⎯⎯⎯⎯⎯⎯⎯%0ASerialized Error: { status: 125, signal: null, output: [ null, null, null ], pid: 2007, stdout: null, stderr: null }%0A
containers/runner test: ::error file=/workspace/diffinery/containers/runner/test/docker.test.ts,title=test/docker.test.ts > docker > runs docker%3A// steps and Dockerfile actions with inputs%2C outputs%2C args and post entrypoints,line=127,column=31::AssertionError: Diffinery runner: job build (build) for acme/widgets@0123456789ab%0ARunner: in lhr14, WEUR, container 93493a3945af99a6d38aaed0fce6a9ef4dd5fcded68dc9b190dadf88bec0883f%0AWorkspace: /tmp/runner-test-RUevT7/widgets%0A##[group]Initialize containers%0ADocker 29.9.1%0Ad2e82bfb89b28564a66082d18731aa427bf34caef675301d68527d7d3c173c9b%0A##[command]docker pull mirror.gcr.io/library/redis:7-alpine%0A7-alpine: Pulling from library/redis%0A4eb14bae0e1d: Pulling fs layer%0A7eb50503c2b0: Pulling fs layer%0A16333ee0c00f: Pulling fs layer%0A83234986c742: Pulling fs layer%0A9928009b15c8: Pulling fs layer%0A1522f9c6f453: Pulling fs layer%0A4f4fb700ef54: Pulling fs layer%0A4f4fb700ef54: Download complete%0A4eb14bae0e1d: Download complete%0Afailed to copy: httpReadSeeker: failed open: could not fetch content descriptor sha256:54779914f171bfa38f26af5e1917062c78d4f03656ae17bc1320b357838f151c (application/vnd.in-toto+json) from remote: not found%0A##[endgroup]%0A##[error]Could not pull mirror.gcr.io/library/redis:7-alpine (docker pull exited with 1).%0AJob completed with conclusion: failure: expected 'failure' to be 'success' // Object.is equality%0A%0AExpected: "success"%0AReceived: "failure"%0A%0A ❯ test/docker.test.ts:127:31%0A%0A
containers/runner test: ::error file=/workspace/diffinery/containers/runner/test/docker.test.ts,title=test/docker.test.ts > docker > runs docker%3A// steps and Dockerfile actions with inputs%2C outputs%2C args and post entrypoints,line=34,column=22::Error: Command failed: docker run --rm -v /tmp/runner-test-RUevT7:/w mirror.gcr.io/library/alpine:3.20 sh -c rm -rf /w/* /w/.[!.]*%0A ❯ test/docker.test.ts:34:22%0A%0A⎯⎯⎯⎯⎯⎯⎯⎯⎯⎯⎯⎯⎯⎯⎯⎯⎯⎯⎯⎯⎯⎯⎯⎯⎯⎯⎯⎯⎯⎯%0ASerialized Error: { status: 125, signal: null, output: [ null, null, null ], pid: 2242, stdout: null, stderr: null }%0A
containers/runner test: Failed
/workspace/diffinery/containers/runner:
ERR_PNPM_RECURSIVE_RUN_FIRST_FAIL @diffinery/runner@0.1.0 test: `vitest run --shard=1/2`
Exit status 1Set up job
Diffinery runner: job test (Unit tests (1/2)) for codician/diffinery@5b162508feddRunner: image diffinery-runner:0d9b89e0a449e5faecf2b19c, in lhr14, WEUR, container 93493a3945af99a6d38aaed0fce6a9ef4dd5fcded68dc9b190dadf88bec0883fRunner size: large (4 vCPU, 12 GiB of memory, 20 GB of disk), this job uses what a smaller runner doesn't have; runs-on: diffinery-large (or -medium, -small, -tiny) sets a sizeHost: AMD EPYC (family 25, model 1), 4 vCPUs, 2000 MHzWorkspace: /workspace/diffineryHost: 3% of the vCPUs' time went to other work on the host (steal)Job completed with conclusion: failureResources: 1.5 of 4 vCPUs busy on average (3.9 at the 95th percentile), peak memory 2.9 GiB of 11.9 GiB, peak disk 2.2 GB of 19.3 GB
Run actions/checkout@v42s
##[group]Run actions/checkout@v4##[endgroup]Syncing repository: codician/diffineryFetching the repository (depth 1)remote: Enumerating objects: 628, done. Receiving objects: 0% (1/628) Receiving objects: 1% (7/628) Receiving objects: 2% (13/628) Receiving objects: 3% (19/628) Receiving objects: 4% (26/628) Receiving objects: 5% (32/628) Receiving objects: 6% (38/628) Receiving objects: 7% (44/628) Receiving objects: 8% (51/628) Receiving objects: 9% (57/628) Receiving objects: 10% (63/628) Receiving objects: 11% (70/628) Receiving objects: 12% (76/628) Receiving objects: 13% (82/628) Receiving objects: 14% (88/628) Receiving objects: 15% (95/628) Receiving objects: 16% (101/628) Receiving objects: 17% (107/628) Receiving objects: 18% (114/628) Receiving objects: 19% (120/628) Receiving objects: 20% (126/628) Receiving objects: 21% (132/628) Receiving objects: 22% (139/628) Receiving objects: 23% (145/628) Receiving objects: 24% (151/628) Receiving objects: 25% (157/628) Receiving objects: 26% (164/628) Receiving objects: 27% (170/628) Receiving objects: 28% (176/628) Receiving objects: 29% (183/628) Receiving objects: 30% (189/628) Receiving objects: 31% (195/628) Receiving objects: 32% (201/628) Receiving objects: 33% (208/628) Receiving objects: 34% (214/628) Receiving objects: 35% (220/628) Receiving objects: 36% (227/628) Receiving objects: 37% (233/628) Receiving objects: 38% (239/628) Receiving objects: 39% (245/628) Receiving objects: 40% (252/628) Receiving objects: 41% (258/628) Receiving objects: 42% (264/628) Receiving objects: 43% (271/628) Receiving objects: 44% (277/628) Receiving objects: 45% (283/628) Receiving objects: 46% (289/628) Receiving objects: 47% (296/628) Receiving objects: 48% (302/628) Receiving objects: 49% (308/628) Receiving objects: 50% (314/628) Receiving objects: 51% (321/628) Receiving objects: 52% (327/628) Receiving objects: 53% (333/628) Receiving objects: 54% (340/628) Receiving objects: 55% (346/628) Receiving objects: 56% (352/628) Receiving objects: 57% (358/628) Receiving objects: 58% (365/628) Receiving objects: 59% (371/628) Receiving objects: 60% (377/628) Receiving objects: 61% (384/628) Receiving objects: 62% (390/628) Receiving objects: 63% (396/628) Receiving objects: 64% (402/628) Receiving objects: 65% (409/628) Receiving objects: 66% (415/628) Receiving objects: 67% (421/628) Receiving objects: 68% (428/628) Receiving objects: 69% (434/628) Receiving objects: 70% (440/628) Receiving objects: 71% (446/628) Receiving objects: 72% (453/628) Receiving objects: 73% (459/628) Receiving objects: 74% (465/628) Receiving objects: 75% (471/628) Receiving objects: 76% (478/628) Receiving objects: 77% (484/628) Receiving objects: 78% (490/628) Receiving objects: 79% (497/628) Receiving objects: 80% (503/628) Receiving objects: 81% (509/628) Receiving objects: 82% (515/628) Receiving objects: 83% (522/628) Receiving objects: 84% (528/628) Receiving objects: 85% (534/628) Receiving objects: 86% (541/628) Receiving objects: 87% (547/628) Receiving objects: 88% (553/628) Receiving objects: 89% (559/628) Receiving objects: 90% (566/628) Receiving objects: 91% (572/628) Receiving objects: 92% (578/628) Receiving objects: 93% (585/628) Receiving objects: 94% (591/628) Receiving objects: 95% (597/628) Receiving objects: 96% (603/628) remote: Total 628 (delta 0), reused 628 (delta 0) Receiving objects: 97% (610/628) Receiving objects: 98% (616/628) Receiving objects: 99% (622/628) Receiving objects: 100% (628/628) Receiving objects: 100% (628/628), 2.57 MiB | 16.66 MiB/s, done.From https://diffinery.com/codician/diffinery * [new ref] 5b162508fedd7e11415da5b38bffecd794cc5f34 -> origin/diffinery-checkoutNote: switching to '5b162508fedd7e11415da5b38bffecd794cc5f34'.You are in 'detached HEAD' state. You can look around, make experimentalchanges and commit them, and you can discard any commits you make in thisstate without impacting any branches by switching back to a branch.If you want to create a new branch to retain commits you create, you maydo so (now or later) by using -c with the switch command. Example: git switch -c <new-branch-name>Or undo this operation with: git switch -Turn off this advice by setting config variable advice.detachedHead to falseHEAD is now at 5b16250 Merge 4253a5d2892f27ece2d926f5400d39d85f4fa953 into 1d727eb5107adfbbd6583db06518f3735044a702HEAD is now at 5b162508fedd7e11415da5b38bffecd794cc5f34
Run pnpm/action-setup@b906affcce14559ad1aafd4ab0e942779e9f58b14s
Download action repository 'pnpm/action-setup@b906affcce14559ad1aafd4ab0e942779e9f58b1'##[group]Run pnpm/action-setup@b906affcce14559ad1aafd4ab0e942779e9f58b1with: dest: ~/setup-pnpm run_install: null cache: false cache_dependency_path: pnpm-lock.yaml package_json_file: package.json standalone: false##[endgroup]##[group]Running self-installer...Progress: resolved 1, reused 0, downloaded 0, added 0Packages: +1+Progress: resolved 1, reused 0, downloaded 1, added 0Progress: resolved 1, reused 0, downloaded 1, added 1, donedependencies:+ pnpm 10.28.0 (12.14.0 is available)Done in 2.1s##[endgroup]Installation Completed!
Run actions/setup-node@v414s
##[group]Run actions/setup-node@v4with: node-version: 22 cache: pnpm##[endgroup]Found in cache @ 22.22.0 (pre-installed node satisfies '22')Cache Size: ~216 MB (226515969 B)Cache restored from key: node-cache-Linux-x64-pnpm-aa519d0d5d7e5a224fb440987e5331e1cb7b3a95e67805db372d6def9572f2b0
Run pnpm install --frozen-lockfile21s
##[group]Run pnpm install --frozen-lockfile##[endgroup]Scope: all 7 workspace projectsLockfile is up to date, resolution step is skippedProgress: resolved 1, reused 0, downloaded 0, added 0Packages: +249++++++++++++++++++++++++++++++++++++++++++++++++++++++++++++++++++++++++++++++++Progress: resolved 249, reused 243, downloaded 0, added 108Progress: resolved 249, reused 243, downloaded 0, added 249, donedevDependencies:+ turbo 2.11.7+ typescript 5.9.3Done in 20.8s using pnpm v10.28.0
Build3s
##[group]Run pnpm -r --if-present build##[endgroup]Scope: 6 of 7 workspace projectsapps/cli build$ esbuild src/bin.ts --bundle --platform=node --target=node22 --format=esm --outfile=dist/diffinery.mjs "--banner:js=#!/usr/bin/env nodeimport { createRequire as __diffineryCreateRequire } from 'node:module'; const require = __diffineryCreateRequire(import.meta.url);"apps/diffinery build$ node islands/build.mjs && node scripts/build-docs.mjscontainers/runner build$ esbuild src/main.ts --bundle --platform=node --target=node22 --format=esm --outfile=dist/agent.mjs --external:bufferutil --external:utf-8-validate "--banner:js=import { createRequire as __diffineryCreateRequire } from 'node:module'; const require = __diffineryCreateRequire(import.meta.url);"containers/runner build: dist/agent.mjs 666.9kbcontainers/runner build: ⚡ Done in 143mscontainers/runner build: Doneapps/cli build: dist/diffinery.mjs 445.1kbapps/cli build: ⚡ Done in 170msapps/cli build: Doneapps/diffinery build: islands: kumo.js 466 KB, kumo.css 149 KB, terminal.js 286 KBapps/diffinery build: docs: 65 pages (+2 generated at runtime), CLI 0.1.0 (234 KiB)apps/diffinery build: Done
Unit tests1m 7s
##[group]Run pnpm -r --if-present run test --shard=1/2##[endgroup]Scope: 6 of 7 workspace projectspackages/git-core test$ vitest run --shard=1/2packages/workflow-yaml test$ vitest run --shard=1/2packages/workflow-yaml test: (!) Your Vite config uses features that are unsupported by `configLoader: 'native'`, which is planned to become the default in a future major version of Vite:packages/workflow-yaml test: - import "../../vitest.shared" without a file extension (vitest.config.ts:2:26). Add the file extensionpackages/workflow-yaml test: - ESM syntax in a file loaded as CommonJS (../../vitest.shared.ts:10:1). Use a `.mjs` extension or set `"type": "module"` in the closest package.jsonpackages/workflow-yaml test: Set `VITE_CONFIG_NATIVE_IGNORE_WARNING=true` to suppress this warning.packages/git-core test: (!) Your Vite config uses features that are unsupported by `configLoader: 'native'`, which is planned to become the default in a future major version of Vite:packages/git-core test: - import "../../vitest.shared" without a file extension (vitest.config.ts:2:26). Add the file extensionpackages/git-core test: - ESM syntax in a file loaded as CommonJS (../../vitest.shared.ts:10:1). Use a `.mjs` extension or set `"type": "module"` in the closest package.jsonpackages/git-core test: Set `VITE_CONFIG_NATIVE_IGNORE_WARNING=true` to suppress this warning.packages/workflow-yaml test: RUN v4.1.11 /workspace/diffinery/packages/workflow-yamlpackages/git-core test: RUN v4.1.11 /workspace/diffinery/packages/git-corepackages/workflow-yaml test: ✓ test/cron.test.ts (23 tests) 60mspackages/workflow-yaml test: ✓ test/expr.test.ts (48 tests) 153mspackages/git-core test: ✓ test/pack-stream.test.ts (3 tests) 428mspackages/git-core test: ✓ is byte for byte the pack writePack builds, and reads one entry at a time 360mspackages/workflow-yaml test: ✓ test/parse.test.ts (31 tests) 384mspackages/workflow-yaml test: Test Files 3 passed (3)packages/workflow-yaml test: Tests 102 passed (102)packages/workflow-yaml test: Start at 15:01:24packages/workflow-yaml test: Duration 1.68s (transform 1.23s, setup 0ms, import 2.04s, tests 597ms, environment 1ms)packages/workflow-yaml test: Donepackages/git-core test: ✓ test/diff-budget.test.ts (5 tests) 1316mspackages/git-core test: ✓ a file rewritten from scratch is diffed in one pass, as one replaced block 553mspackages/git-core test: ✓ a three-way merge too large to compute is a conflict, quickly 738mspackages/git-core test: ✓ test/pack-limits.test.ts (6 tests) 17973mspackages/git-core test: ✓ resolves a long delta chain in one pass, whatever order the pack lists it in 10350mspackages/git-core test: ✓ counts what each object costs in memory, not only its content 4910mspackages/git-core test: ✓ refuses a small pack whose objects inflate past the memory budget 2627mspackages/git-core test: Test Files 3 passed (3)packages/git-core test: Tests 14 passed (14)packages/git-core test: Start at 15:01:24packages/git-core test: Duration 19.11s (transform 1.22s, setup 0ms, import 1.85s, tests 19.72s, environment 1ms)packages/git-core test: Doneapps/cli test$ vitest run --shard=1/2apps/diffinery test$ vitest run --passWithNoTests --exclude 'test/e2e/**' --shard=1/2containers/runner test$ vitest run --shard=1/2apps/diffinery test: (!) Your Vite config uses features that are unsupported by `configLoader: 'native'`, which is planned to become the default in a future major version of Vite:apps/diffinery test: - import "../../vitest.shared" without a file extension (vitest.config.ts:3:26). Add the file extensionapps/diffinery test: - ESM syntax in a file loaded as CommonJS (../../vitest.shared.ts:10:1). Use a `.mjs` extension or set `"type": "module"` in the closest package.jsonapps/diffinery test: Set `VITE_CONFIG_NATIVE_IGNORE_WARNING=true` to suppress this warning.apps/diffinery test: RUN v4.1.11 /workspace/diffinery/apps/diffinerycontainers/runner test: (!) Your Vite config uses features that are unsupported by `configLoader: 'native'`, which is planned to become the default in a future major version of Vite:containers/runner test: - import "../../vitest.shared" without a file extension (vitest.config.ts:2:26). Add the file extensioncontainers/runner test: - ESM syntax in a file loaded as CommonJS (../../vitest.shared.ts:10:1). Use a `.mjs` extension or set `"type": "module"` in the closest package.jsoncontainers/runner test: Set `VITE_CONFIG_NATIVE_IGNORE_WARNING=true` to suppress this warning.containers/runner test: RUN v4.1.11 /workspace/diffinery/containers/runnerapps/cli test: (!) Your Vite config uses features that are unsupported by `configLoader: 'native'`, which is planned to become the default in a future major version of Vite:apps/cli test: - import "../../vitest.shared" without a file extension (vitest.config.ts:2:26). Add the file extensionapps/cli test: - ESM syntax in a file loaded as CommonJS (../../vitest.shared.ts:10:1). Use a `.mjs` extension or set `"type": "module"` in the closest package.jsonapps/cli test: Set `VITE_CONFIG_NATIVE_IGNORE_WARNING=true` to suppress this warning.apps/cli test: RUN v4.1.11 /workspace/diffinery/apps/cliapps/diffinery test: (node:382) ExperimentalWarning: SQLite is an experimental feature and might change at any timeapps/diffinery test: (Use `node --trace-warnings ...` to show where the warning was created)apps/diffinery test: (node:383) ExperimentalWarning: SQLite is an experimental feature and might change at any timeapps/diffinery test: (Use `node --trace-warnings ...` to show where the warning was created)apps/diffinery test: ✓ test/unit/usage.test.ts (23 tests) 287mscontainers/runner test: ✓ test/jail.test.ts (12 tests) 277msapps/diffinery test: (node:452) ExperimentalWarning: SQLite is an experimental feature and might change at any timeapps/diffinery test: (Use `node --trace-warnings ...` to show where the warning was created)apps/cli test: ✓ test/login.test.ts (12 tests) 1151msapps/cli test: ✓ opens the authorize page with a PKCE challenge, trades the code with the verifier, and saves the token 400msapps/diffinery test: stderr | test/unit/suppression.test.ts > Email Sending's answer to a send > puts a refused recipient on the list (source send) and audits it; temporary failures change nothingapps/diffinery test: email failed test Ann@Example.com E_RECIPIENT_SUPPRESSED: recipient is suppressedapps/diffinery test: stderr | test/unit/suppression.test.ts > Email Sending's answer to a send > puts a refused recipient on the list (source send) and audits it; temporary failures change nothingapps/diffinery test: email failed test bob@example.com E_DAILY_LIMIT_EXCEEDED: nopeapps/diffinery test: ✓ test/unit/suppression.test.ts (11 tests) 965mscontainers/runner test: ✓ test/relay.test.ts (4 tests) 1737mscontainers/runner test: ✓ splits a single-PUT upload (containerd) into PATCH chunks under the limit 366mscontainers/runner test: ✓ answers a streamed PATCH (docker) like the registry would, then completes with an empty PUT 1066msapps/diffinery test: (node:751) ExperimentalWarning: SQLite is an experimental feature and might change at any timeapps/diffinery test: (Use `node --trace-warnings ...` to show where the warning was created)apps/diffinery test: ✓ test/unit/runner-sizes.test.ts (19 tests) 1523msapps/diffinery test: ✓ runs a first job large, then sizes it by what it used 454msapps/diffinery test: ✓ runs a job where runs-on asks, and stops it there 305msapps/diffinery test: ✓ starts a job large when no smaller runner was free for it 440msapps/cli test: ✓ test/migrate.test.ts (4 tests) 2993msapps/cli test: ✓ creates the repo, pushes branches and tags, and copies issues, PRs, variables and secret names 924msapps/cli test: ✓ repo clone authenticates for that command only 1073msapps/cli test: ✓ without --local, starts a server import and follows it to completion 404msapps/cli test: ✓ --private and --to override the target 583mscontainers/runner test: ✓ test/runtime.test.ts (11 tests) 3328mscontainers/runner test: ✓ writes archives unzip reads, and reads archives zip writes 315mscontainers/runner test: ✓ uploads large files as blocks, small ones in one request, and downloads them back 2798msapps/diffinery test: stderr | test/unit/moderation.test.ts > suspension > refuses tokens and sessions at once, stops Actions, and unsuspending restores the tokensapps/diffinery test: mail queue not bound; dropping 1 email(s)apps/cli test: ✓ test/pr.test.ts (19 tests) 3374msapps/cli test: ✓ pr create infers the repo from origin and the head from the current branch 332msapps/cli test: ✓ pr view, checks, diff, comment, review, ready and merge default to the current branch's pull request 667msapps/cli test: ✓ pr checks --watch waits for the first check right after a push, and gives up after 2 minutes 1331msapps/diffinery test: stderr | test/unit/moderation.test.ts > suspension > refuses tokens and sessions at once, stops Actions, and unsuspending restores the tokensapps/diffinery test: mail queue not bound; dropping 1 email(s)apps/diffinery test: ✓ test/unit/moderation.test.ts (9 tests) 615msapps/cli test: ✓ test/misc.test.ts (9 tests) 697msapps/cli test: Test Files 4 passed (4)apps/cli test: Tests 44 passed (44)apps/cli test: Start at 15:01:45apps/cli test: Duration 6.40s (transform 4.08s, setup 0ms, import 6.93s, tests 8.22s, environment 1ms)apps/cli test: Doneapps/diffinery test: (node:1045) ExperimentalWarning: SQLite is an experimental feature and might change at any timeapps/diffinery test: (Use `node --trace-warnings ...` to show where the warning was created)apps/diffinery test: ✓ test/unit/review.test.ts (19 tests) 47msapps/diffinery test: ✓ test/unit/rerun.test.ts (10 tests) 2990msapps/diffinery test: ✓ keeps the legs that passed and re-runs the failed and cancelled ones, with what depends on them 760msapps/diffinery test: ✓ refuses a run without failed jobs, and one that hasn't finished 452msapps/diffinery test: ✓ checks permissions like a full re-run 320msapps/diffinery test: ✓ starts up to max-parallel re-run legs; kept legs don't count 327msapps/diffinery test: ✓ test/unit/auto-merge.test.ts (12 tests) 512msapps/diffinery test: ✓ test/unit/job-permissions.test.ts (8 tests) 80msapps/diffinery test: (node:1211) ExperimentalWarning: SQLite is an experimental feature and might change at any timeapps/diffinery test: (Use `node --trace-warnings ...` to show where the warning was created)apps/diffinery test: stderr | test/unit/rate-limit.test.ts > rate limit checks > lets requests through when no limiter is configured or the limiter failsapps/diffinery test: rate limiter failed RL_ANON Error: downapps/diffinery test: at Object.limit (/workspace/diffinery/apps/diffinery/test/unit/rate-limit.test.ts:89:67)apps/diffinery test: at overLimit (/workspace/diffinery/apps/diffinery/src/lib/rate-limit.ts:71:22)apps/diffinery test: at /workspace/diffinery/apps/diffinery/test/unit/rate-limit.test.ts:90:18apps/diffinery test: at process.processTicksAndRejections (node:internal/process/task_queues:105:5)apps/diffinery test: ✓ test/unit/today.test.ts (10 tests) 42msapps/diffinery test: stderr | test/unit/killswitch.test.ts > kill switches > counts repositories that couldn't be stopped, and needs a reasonapps/diffinery test: kill switch: stopping work in repository broken failed Error: goneapps/diffinery test: at Object.stopActions (/workspace/diffinery/apps/diffinery/test/unit/killswitch.test.ts:24:36)apps/diffinery test: at worker (/workspace/diffinery/apps/diffinery/src/lib/killswitch.ts:155:63)apps/diffinery test: at Function.from (<anonymous>)apps/diffinery test: at stopIn (/workspace/diffinery/apps/diffinery/src/lib/killswitch.ts:166:27)apps/diffinery test: at changePause (/workspace/diffinery/apps/diffinery/src/lib/killswitch.ts:225:21)apps/diffinery test: at process.processTicksAndRejections (node:internal/process/task_queues:105:5)apps/diffinery test: at /workspace/diffinery/apps/diffinery/test/unit/killswitch.test.ts:123:12apps/diffinery test: at async file:///workspace/diffinery/node_modules/.pnpm/@vitest+runner@4.1.11/node_modules/@vitest/runner/dist/chunk-artifact.js:1903:20apps/diffinery test: ✓ test/unit/killswitch.test.ts (5 tests) 293msapps/diffinery test: ✓ test/unit/coordinator.test.ts (8 tests) 24mscontainers/runner test: ✓ test/import.test.ts (7 tests) 8611mscontainers/runner test: ✓ pushes history in chunks under a size limit the server enforces, then every ref, and cleans up 5576mscontainers/runner test: ✓ pushes every version of a large file first and whole, so the server never rebuilds one from a delta 1601mscontainers/runner test: ✓ splits a refused batch of a large commit's files again, rather than retrying it whole 1409msapps/diffinery test: ✓ test/unit/secret-scan.test.ts (7 tests) 1432msapps/diffinery test: ✓ scans large blobs from their compressed bytes, slice by slice, with the same rules 525msapps/diffinery test: ✓ scans a large file in slices, never as one string, with the same results 885msapps/diffinery test: ✓ test/unit/job-graph.test.ts (12 tests) 57msapps/diffinery test: ✓ test/unit/project.test.ts (12 tests) 20msapps/diffinery test: (node:1864) ExperimentalWarning: SQLite is an experimental feature and might change at any timeapps/diffinery test: (Use `node --trace-warnings ...` to show where the warning was created)apps/diffinery test: stderr | test/unit/rate-limit.test.ts > model requests per paying person (phase 5a) > counts per person, and lets requests through without a binding or when it failsapps/diffinery test: model rate limiter failed Error: downapps/diffinery test: at Object.limit (/workspace/diffinery/apps/diffinery/test/unit/rate-limit.test.ts:130:61)apps/diffinery test: at modelRateLimited (/workspace/diffinery/apps/diffinery/src/lib/rate-limit.ts:90:33)apps/diffinery test: at /workspace/diffinery/apps/diffinery/test/unit/rate-limit.test.ts:131:18apps/diffinery test: at process.processTicksAndRejections (node:internal/process/task_queues:105:5)apps/diffinery test: at async file:///workspace/diffinery/node_modules/.pnpm/@vitest+runner@4.1.11/node_modules/@vitest/runner/dist/chunk-artifact.js:1903:20apps/diffinery test: ✓ test/unit/rate-limit.test.ts (10 tests) 5352msapps/diffinery test: ✓ answers 429 with retry-after once an anonymous address is over its limit 5303msapps/diffinery test: ✓ test/unit/job-token.test.ts (7 tests) 213msapps/diffinery test: ✓ test/unit/markdown-safety.test.ts (28 tests) 592msapps/diffinery test: (node:1877) ExperimentalWarning: SQLite is an experimental feature and might change at any timeapps/diffinery test: (Use `node --trace-warnings ...` to show where the warning was created)apps/diffinery test: ✓ test/unit/reusable.test.ts (4 tests) 51msapps/diffinery test: ✓ test/unit/visibility.test.ts (3 tests) 135msapps/diffinery test: ✓ test/unit/deploy-log-notes.test.ts (2 tests) 98msapps/diffinery test: ✓ test/unit/required.test.ts (11 tests) 16msapps/diffinery test: ✓ test/unit/redirects.test.ts (9 tests) 18msapps/diffinery test: ✓ test/unit/fsck.test.ts (16 tests) 1028msapps/diffinery test: ✓ refuses a tree too large to check, before reading its names 994msapps/diffinery test: ✓ test/unit/registry-upload.test.ts (2 tests) 915msapps/diffinery test: ✓ hash each chunk as it arrives, so the final request doesn't read the blob back 809msapps/diffinery test: ✓ test/unit/push-retry.test.ts (4 tests) 20msapps/diffinery test: ✓ test/unit/wait-timer.test.ts (5 tests) 12msapps/diffinery test: ✓ test/unit/org-variables.test.ts (2 tests) 16msapps/diffinery test: ✓ test/unit/stages.test.ts (3 tests) 18msapps/diffinery test: ✓ test/unit/d1.test.ts (3 tests) 9msapps/diffinery test: ✓ test/unit/environment-secrets.test.ts (4 tests) 11msapps/diffinery test: ✓ test/unit/upload-pack.test.ts (1 test) 1320msapps/diffinery test: ✓ sends each object as it is read, in side-band packets, never the whole pack at once 1318msapps/diffinery test: ✓ test/unit/receive-head.test.ts (2 tests) 31msapps/diffinery test: ✓ test/unit/job-secrets.test.ts (4 tests) 17msapps/diffinery test: ✓ test/unit/tree-names.test.ts (5 tests) 10msapps/diffinery test: (node:2101) ExperimentalWarning: SQLite is an experimental feature and might change at any timeapps/diffinery test: (Use `node --trace-warnings ...` to show where the warning was created)apps/diffinery test: ✓ test/unit/inflight.test.ts (1 test) 44msapps/diffinery test: ✓ test/unit/archive-stream.test.ts (3 tests) 588msapps/diffinery test: ✓ refuse more entries than classic zip can hold instead of writing a broken archive 397msapps/diffinery test: ✓ test/unit/terminal-command.test.ts (1 test) 16msapps/diffinery test: ✓ test/unit/unpack-failure.test.ts (2 tests) 11msapps/diffinery test: ✓ test/unit/graphql.test.ts (3 tests) 58msapps/diffinery test: Test Files 39 passed (39)apps/diffinery test: Tests 300 passed (300)apps/diffinery test: Start at 15:01:44apps/diffinery test: Duration 19.72s (transform 13.69s, setup 0ms, import 22.00s, tests 19.49s, environment 10ms)apps/diffinery test: Donecontainers/runner test: ❯ test/docker.test.ts (4 tests | 2 failed) 34212mscontainers/runner test: × runs steps and JavaScript actions in a job container next to a service container 9183mscontainers/runner test: × runs docker:// steps and Dockerfile actions with inputs, outputs, args and post entrypoints 12043mscontainers/runner test: ✓ fails a service that never gets healthy, and cleans up 12192mscontainers/runner test: ✓ explains that containers need Docker 791mscontainers/runner test: ⎯⎯⎯⎯⎯⎯⎯ Failed Tests 2 ⎯⎯⎯⎯⎯⎯⎯containers/runner test: FAIL test/docker.test.ts > docker > runs steps and JavaScript actions in a job container next to a service containercontainers/runner test: AssertionError: Diffinery runner: job build (build) for acme/widgets@0123456789abcontainers/runner test: Runner: in lhr14, WEUR, container 93493a3945af99a6d38aaed0fce6a9ef4dd5fcded68dc9b190dadf88bec0883fcontainers/runner test: Workspace: /tmp/runner-test-09Ge6q/widgetscontainers/runner test: ##[group]Initialize containerscontainers/runner test: Docker 29.9.1containers/runner test: d150d89bc5026c6f739997cd1b5b17f4ee56df64dbae1aed87d1dc857a38ac71containers/runner test: ##[command]docker pull mirror.gcr.io/library/redis:7-alpinecontainers/runner test: 7-alpine: Pulling from library/rediscontainers/runner test: 4eb14bae0e1d: Pulling fs layercontainers/runner test: 83234986c742: Pulling fs layercontainers/runner test: 16333ee0c00f: Pulling fs layercontainers/runner test: 1522f9c6f453: Pulling fs layercontainers/runner test: 7eb50503c2b0: Pulling fs layercontainers/runner test: 9928009b15c8: Pulling fs layercontainers/runner test: 4f4fb700ef54: Pulling fs layercontainers/runner test: 83234986c742: Download completecontainers/runner test: failed to copy: httpReadSeeker: failed open: could not fetch content descriptor sha256:54779914f171bfa38f26af5e1917062c78d4f03656ae17bc1320b357838f151c (application/vnd.in-toto+json) from remote: not foundcontainers/runner test: ##[endgroup]containers/runner test: ##[error]Could not pull mirror.gcr.io/library/redis:7-alpine (docker pull exited with 1).containers/runner test: Job completed with conclusion: failure: expected 'failure' to be 'success' // Object.is equalitycontainers/runner test: Expected: "success"containers/runner test: Received: "failure"containers/runner test: ❯ test/docker.test.ts:85:31containers/runner test: 83| const c = await run(spec);containers/runner test: 84| const log = api.logText();containers/runner test: 85| expect(c.conclusion, log).toBe("success");containers/runner test: | ^containers/runner test: 86| expect(log).toContain(`in debian, home=/github/home, ws=${path.joi…containers/runner test: 87| expect(log).toContain("redis says +PONG");containers/runner test: ⎯⎯⎯⎯⎯⎯⎯⎯⎯⎯⎯⎯⎯⎯⎯⎯⎯⎯⎯⎯⎯⎯⎯⎯[1/4]⎯containers/runner test: FAIL test/docker.test.ts > docker > runs steps and JavaScript actions in a job container next to a service containercontainers/runner test: Error: Command failed: docker run --rm -v /tmp/runner-test-09Ge6q:/w mirror.gcr.io/library/alpine:3.20 sh -c rm -rf /w/* /w/.[!.]*containers/runner test: ❯ test/docker.test.ts:34:22containers/runner test: 32| await api.close();containers/runner test: 33| // Containers may leave root-owned files behind; clean up through Do…containers/runner test: 34| if (dockerWorks()) execFileSync("docker", ["run", "--rm", "-v", `${w…containers/runner test: | ^containers/runner test: 35| rmSync(workRoot, { recursive: true, force: true });containers/runner test: 36| });containers/runner test: ⎯⎯⎯⎯⎯⎯⎯⎯⎯⎯⎯⎯⎯⎯⎯⎯⎯⎯⎯⎯⎯⎯⎯⎯[2/4]⎯containers/runner test: FAIL test/docker.test.ts > docker > runs docker:// steps and Dockerfile actions with inputs, outputs, args and post entrypointscontainers/runner test: AssertionError: Diffinery runner: job build (build) for acme/widgets@0123456789abcontainers/runner test: Runner: in lhr14, WEUR, container 93493a3945af99a6d38aaed0fce6a9ef4dd5fcded68dc9b190dadf88bec0883fcontainers/runner test: Workspace: /tmp/runner-test-RUevT7/widgetscontainers/runner test: ##[group]Initialize containerscontainers/runner test: Docker 29.9.1containers/runner test: d2e82bfb89b28564a66082d18731aa427bf34caef675301d68527d7d3c173c9bcontainers/runner test: ##[command]docker pull mirror.gcr.io/library/redis:7-alpinecontainers/runner test: 7-alpine: Pulling from library/rediscontainers/runner test: 4eb14bae0e1d: Pulling fs layercontainers/runner test: 7eb50503c2b0: Pulling fs layercontainers/runner test: 16333ee0c00f: Pulling fs layercontainers/runner test: 83234986c742: Pulling fs layercontainers/runner test: 9928009b15c8: Pulling fs layercontainers/runner test: 1522f9c6f453: Pulling fs layercontainers/runner test: 4f4fb700ef54: Pulling fs layercontainers/runner test: 4f4fb700ef54: Download completecontainers/runner test: 4eb14bae0e1d: Download completecontainers/runner test: failed to copy: httpReadSeeker: failed open: could not fetch content descriptor sha256:54779914f171bfa38f26af5e1917062c78d4f03656ae17bc1320b357838f151c (application/vnd.in-toto+json) from remote: not foundcontainers/runner test: ##[endgroup]containers/runner test: ##[error]Could not pull mirror.gcr.io/library/redis:7-alpine (docker pull exited with 1).containers/runner test: Job completed with conclusion: failure: expected 'failure' to be 'success' // Object.is equalitycontainers/runner test: Expected: "success"containers/runner test: Received: "failure"containers/runner test: ❯ test/docker.test.ts:127:31containers/runner test: 125| const c = await run(spec);containers/runner test: 126| const log = api.logText();containers/runner test: 127| expect(c.conclusion, log).toBe("success");containers/runner test: | ^containers/runner test: 128| expect(log).toContain("hello octo [two words] input=octo ws=/githu…containers/runner test: 129| expect(log).toContain("+PONG");containers/runner test: ⎯⎯⎯⎯⎯⎯⎯⎯⎯⎯⎯⎯⎯⎯⎯⎯⎯⎯⎯⎯⎯⎯⎯⎯[3/4]⎯containers/runner test: FAIL test/docker.test.ts > docker > runs docker:// steps and Dockerfile actions with inputs, outputs, args and post entrypointscontainers/runner test: Error: Command failed: docker run --rm -v /tmp/runner-test-RUevT7:/w mirror.gcr.io/library/alpine:3.20 sh -c rm -rf /w/* /w/.[!.]*containers/runner test: ❯ test/docker.test.ts:34:22containers/runner test: 32| await api.close();containers/runner test: 33| // Containers may leave root-owned files behind; clean up through Do…containers/runner test: 34| if (dockerWorks()) execFileSync("docker", ["run", "--rm", "-v", `${w…containers/runner test: | ^containers/runner test: 35| rmSync(workRoot, { recursive: true, force: true });containers/runner test: 36| });containers/runner test: ⎯⎯⎯⎯⎯⎯⎯⎯⎯⎯⎯⎯⎯⎯⎯⎯⎯⎯⎯⎯⎯⎯⎯⎯[4/4]⎯containers/runner test: Test Files 1 failed | 4 passed (5)containers/runner test: Tests 2 failed | 36 passed (38)containers/runner test: Start at 15:01:45containers/runner test: Duration 44.90s (transform 3.19s, setup 0ms, import 9.84s, tests 48.17s, environment 6ms)containers/runner test: ::error file=/workspace/diffinery/containers/runner/test/docker.test.ts,title=test/docker.test.ts > docker > runs steps and JavaScript actions in a job container next to a service container,line=85,column=31::AssertionError: Diffinery runner: job build (build) for acme/widgets@0123456789ab%0ARunner: in lhr14, WEUR, container 93493a3945af99a6d38aaed0fce6a9ef4dd5fcded68dc9b190dadf88bec0883f%0AWorkspace: /tmp/runner-test-09Ge6q/widgets%0A##[group]Initialize containers%0ADocker 29.9.1%0Ad150d89bc5026c6f739997cd1b5b17f4ee56df64dbae1aed87d1dc857a38ac71%0A##[command]docker pull mirror.gcr.io/library/redis:7-alpine%0A7-alpine: Pulling from library/redis%0A4eb14bae0e1d: Pulling fs layer%0A83234986c742: Pulling fs layer%0A16333ee0c00f: Pulling fs layer%0A1522f9c6f453: Pulling fs layer%0A7eb50503c2b0: Pulling fs layer%0A9928009b15c8: Pulling fs layer%0A4f4fb700ef54: Pulling fs layer%0A83234986c742: Download complete%0Afailed to copy: httpReadSeeker: failed open: could not fetch content descriptor sha256:54779914f171bfa38f26af5e1917062c78d4f03656ae17bc1320b357838f151c (application/vnd.in-toto+json) from remote: not found%0A##[endgroup]%0A##[error]Could not pull mirror.gcr.io/library/redis:7-alpine (docker pull exited with 1).%0AJob completed with conclusion: failure: expected 'failure' to be 'success' // Object.is equality%0A%0AExpected: "success"%0AReceived: "failure"%0A%0A ❯ test/docker.test.ts:85:31%0A%0Acontainers/runner test: ::error file=/workspace/diffinery/containers/runner/test/docker.test.ts,title=test/docker.test.ts > docker > runs steps and JavaScript actions in a job container next to a service container,line=34,column=22::Error: Command failed: docker run --rm -v /tmp/runner-test-09Ge6q:/w mirror.gcr.io/library/alpine:3.20 sh -c rm -rf /w/* /w/.[!.]*%0A ❯ test/docker.test.ts:34:22%0A%0A⎯⎯⎯⎯⎯⎯⎯⎯⎯⎯⎯⎯⎯⎯⎯⎯⎯⎯⎯⎯⎯⎯⎯⎯⎯⎯⎯⎯⎯⎯%0ASerialized Error: { status: 125, signal: null, output: [ null, null, null ], pid: 2007, stdout: null, stderr: null }%0Acontainers/runner test: ::error file=/workspace/diffinery/containers/runner/test/docker.test.ts,title=test/docker.test.ts > docker > runs docker%3A// steps and Dockerfile actions with inputs%2C outputs%2C args and post entrypoints,line=127,column=31::AssertionError: Diffinery runner: job build (build) for acme/widgets@0123456789ab%0ARunner: in lhr14, WEUR, container 93493a3945af99a6d38aaed0fce6a9ef4dd5fcded68dc9b190dadf88bec0883f%0AWorkspace: /tmp/runner-test-RUevT7/widgets%0A##[group]Initialize containers%0ADocker 29.9.1%0Ad2e82bfb89b28564a66082d18731aa427bf34caef675301d68527d7d3c173c9b%0A##[command]docker pull mirror.gcr.io/library/redis:7-alpine%0A7-alpine: Pulling from library/redis%0A4eb14bae0e1d: Pulling fs layer%0A7eb50503c2b0: Pulling fs layer%0A16333ee0c00f: Pulling fs layer%0A83234986c742: Pulling fs layer%0A9928009b15c8: Pulling fs layer%0A1522f9c6f453: Pulling fs layer%0A4f4fb700ef54: Pulling fs layer%0A4f4fb700ef54: Download complete%0A4eb14bae0e1d: Download complete%0Afailed to copy: httpReadSeeker: failed open: could not fetch content descriptor sha256:54779914f171bfa38f26af5e1917062c78d4f03656ae17bc1320b357838f151c (application/vnd.in-toto+json) from remote: not found%0A##[endgroup]%0A##[error]Could not pull mirror.gcr.io/library/redis:7-alpine (docker pull exited with 1).%0AJob completed with conclusion: failure: expected 'failure' to be 'success' // Object.is equality%0A%0AExpected: "success"%0AReceived: "failure"%0A%0A ❯ test/docker.test.ts:127:31%0A%0Acontainers/runner test: ::error file=/workspace/diffinery/containers/runner/test/docker.test.ts,title=test/docker.test.ts > docker > runs docker%3A// steps and Dockerfile actions with inputs%2C outputs%2C args and post entrypoints,line=34,column=22::Error: Command failed: docker run --rm -v /tmp/runner-test-RUevT7:/w mirror.gcr.io/library/alpine:3.20 sh -c rm -rf /w/* /w/.[!.]*%0A ❯ test/docker.test.ts:34:22%0A%0A⎯⎯⎯⎯⎯⎯⎯⎯⎯⎯⎯⎯⎯⎯⎯⎯⎯⎯⎯⎯⎯⎯⎯⎯⎯⎯⎯⎯⎯⎯%0ASerialized Error: { status: 125, signal: null, output: [ null, null, null ], pid: 2242, stdout: null, stderr: null }%0Acontainers/runner test: Failed/workspace/diffinery/containers/runner: ERR_PNPM_RECURSIVE_RUN_FIRST_FAIL @diffinery/runner@0.1.0 test: `vitest run --shard=1/2`Exit status 1##[error]Process completed with exit code 1.
Post Run pnpm/action-setup@b906affcce14559ad1aafd4ab0e942779e9f58b10s
Pruning is unnecessary.Post Run actions/checkout@v40s
Removing persisted credentialsJob summary
Vitest Test Report
Summary
- Test Files: ✅ 3 passes · 3 total
- Test Results: ✅ 102 passes · 102 total
Vitest Test Report
Summary
- Test Files: ✅ 3 passes · 3 total
- Test Results: ✅ 14 passes · 14 total
Vitest Test Report
Summary
- Test Files: ✅ 4 passes · 4 total
- Test Results: ✅ 44 passes · 44 total
Vitest Test Report
Summary
- Test Files: ✅ 39 passes · 39 total
- Test Results: ✅ 300 passes · 300 total
Vitest Test Report
Summary
- Test Files: ❌ 1 failure · ✅ 4 passes · 5 total
- Test Results: ❌ 2 failures · ✅ 36 passes · 38 total