End-to-end (real histories)
took 9m 44s Raw logs
Matrix: name: real histories, shard: histories
Failed at Run the shard's tests
Process completed with exit code 1.
1..4
not ok 1 - real histories: whole projects, side by side
---
duration_ms: 564637.455523
type: 'suite'
location: '/workspace/diffinery/apps/diffinery/test/e2e/e2e.test.mjs:2864:1'
failureType: 'subtestsFailed'
error: '1 subtest failed'
code: 'ERR_TEST_FAILURE'
...
1..1
# tests 4
# suites 1
# pass 3
# fail 1
# cancelled 0
# skipped 0
# todo 0
# duration_ms 566866.425714Set up job
Diffinery runner: job e2e (End-to-end (real histories)) for codician/diffinery@c9968686398fRunner: image diffinery-runner:8a871c84f8ee3e93f0d40c7d, in lhr21, WEUR, container 1e512b123f040b122b0a8f1b307dc9614693021d3fac624b32530e7e48bb661cRunner size: large (4 vCPU, 12 GiB of memory, 20 GB of disk), an earlier run of this job wasn't measured closely enough (busy cores every quarter second); runs-on: diffinery-large (or -medium, -small, -tiny) sets a sizeHost: AMD EPYC (family 25, model 17), 4 vCPUs, 2546 MHzWorkspace: /workspace/diffineryHost: 1% of the vCPUs' time went to other work on the host (steal)Job completed with conclusion: failureResources: 3.6 of 4 vCPUs busy on average (4.0 at the 95th percentile), peak memory 11.9 GiB of 11.9 GiB, peak disk 2.8 GB of 19.3 GB, 1 process(es) killed for want of memory
Run actions/checkout@v43s
##[group]Run actions/checkout@v4##[endgroup]Syncing repository: codician/diffineryFetching the repository (depth 1)remote: Enumerating objects: 684, done. Receiving objects: 0% (1/684) Receiving objects: 1% (7/684) Receiving objects: 2% (14/684) Receiving objects: 3% (21/684) Receiving objects: 4% (28/684) Receiving objects: 5% (35/684) Receiving objects: 6% (42/684) Receiving objects: 7% (48/684) Receiving objects: 8% (55/684) Receiving objects: 9% (62/684) Receiving objects: 10% (69/684) Receiving objects: 11% (76/684) Receiving objects: 12% (83/684) Receiving objects: 13% (89/684) Receiving objects: 14% (96/684) Receiving objects: 15% (103/684) Receiving objects: 16% (110/684) Receiving objects: 17% (117/684) Receiving objects: 18% (124/684) Receiving objects: 19% (130/684) Receiving objects: 20% (137/684) Receiving objects: 21% (144/684) Receiving objects: 22% (151/684), 1.07 MiB | 1.21 MiB/s Receiving objects: 23% (158/684), 1.07 MiB | 1.21 MiB/s Receiving objects: 24% (165/684), 1.07 MiB | 1.21 MiB/s Receiving objects: 25% (171/684), 1.07 MiB | 1.21 MiB/s Receiving objects: 26% (178/684), 1.07 MiB | 1.21 MiB/s Receiving objects: 27% (185/684), 1.07 MiB | 1.21 MiB/s Receiving objects: 28% (192/684), 1.07 MiB | 1.21 MiB/s Receiving objects: 29% (199/684), 1.07 MiB | 1.21 MiB/s Receiving objects: 30% (206/684), 1.07 MiB | 1.21 MiB/s Receiving objects: 31% (213/684), 1.07 MiB | 1.21 MiB/s Receiving objects: 32% (219/684), 1.07 MiB | 1.21 MiB/s Receiving objects: 33% (226/684), 1.07 MiB | 1.21 MiB/s Receiving objects: 34% (233/684), 1.07 MiB | 1.21 MiB/s Receiving objects: 35% (240/684), 1.07 MiB | 1.21 MiB/s Receiving objects: 36% (247/684), 1.07 MiB | 1.21 MiB/s Receiving objects: 37% (254/684), 1.07 MiB | 1.21 MiB/s Receiving objects: 38% (260/684), 1.07 MiB | 1.21 MiB/s Receiving objects: 39% (267/684), 1.07 MiB | 1.21 MiB/s Receiving objects: 40% (274/684), 1.07 MiB | 1.21 MiB/s Receiving objects: 41% (281/684), 1.07 MiB | 1.21 MiB/s Receiving objects: 42% (288/684), 1.07 MiB | 1.21 MiB/s Receiving objects: 43% (295/684), 1.07 MiB | 1.21 MiB/s Receiving objects: 44% (301/684), 1.07 MiB | 1.21 MiB/s Receiving objects: 45% (308/684), 1.07 MiB | 1.21 MiB/s Receiving objects: 46% (315/684), 1.07 MiB | 1.21 MiB/s Receiving objects: 47% (322/684), 1.07 MiB | 1.21 MiB/s Receiving objects: 48% (329/684), 1.07 MiB | 1.21 MiB/s Receiving objects: 49% (336/684), 1.07 MiB | 1.21 MiB/s Receiving objects: 50% (342/684), 1.07 MiB | 1.21 MiB/s Receiving objects: 51% (349/684), 1.07 MiB | 1.21 MiB/s Receiving objects: 52% (356/684), 1.07 MiB | 1.21 MiB/s Receiving objects: 53% (363/684), 1.07 MiB | 1.21 MiB/s Receiving objects: 54% (370/684), 1.07 MiB | 1.21 MiB/s Receiving objects: 55% (377/684), 1.07 MiB | 1.21 MiB/s Receiving objects: 56% (384/684), 1.07 MiB | 1.21 MiB/s Receiving objects: 57% (390/684), 1.07 MiB | 1.21 MiB/s Receiving objects: 58% (397/684), 1.07 MiB | 1.21 MiB/s Receiving objects: 59% (404/684), 1.07 MiB | 1.21 MiB/s Receiving objects: 60% (411/684), 1.07 MiB | 1.21 MiB/s Receiving objects: 61% (418/684), 1.07 MiB | 1.21 MiB/s Receiving objects: 62% (425/684), 1.07 MiB | 1.21 MiB/s Receiving objects: 63% (431/684), 1.07 MiB | 1.21 MiB/s Receiving objects: 64% (438/684), 1.07 MiB | 1.21 MiB/s Receiving objects: 65% (445/684), 1.07 MiB | 1.21 MiB/s Receiving objects: 66% (452/684), 1.07 MiB | 1.21 MiB/s Receiving objects: 67% (459/684), 1.07 MiB | 1.21 MiB/s Receiving objects: 68% (466/684), 1.07 MiB | 1.21 MiB/s Receiving objects: 69% (472/684), 1.07 MiB | 1.21 MiB/s Receiving objects: 70% (479/684), 1.07 MiB | 1.21 MiB/s Receiving objects: 71% (486/684), 1.07 MiB | 1.21 MiB/s Receiving objects: 72% (493/684), 1.07 MiB | 1.21 MiB/s Receiving objects: 73% (500/684), 1.07 MiB | 1.21 MiB/s Receiving objects: 74% (507/684), 1.07 MiB | 1.21 MiB/s Receiving objects: 75% (513/684), 1.07 MiB | 1.21 MiB/s Receiving objects: 76% (520/684), 1.07 MiB | 1.21 MiB/s Receiving objects: 77% (527/684), 1.07 MiB | 1.21 MiB/s Receiving objects: 78% (534/684), 1.07 MiB | 1.21 MiB/s Receiving objects: 79% (541/684), 1.07 MiB | 1.21 MiB/s Receiving objects: 80% (548/684), 1.07 MiB | 1.21 MiB/s Receiving objects: 81% (555/684), 1.07 MiB | 1.21 MiB/s Receiving objects: 82% (561/684), 1.07 MiB | 1.21 MiB/s Receiving objects: 83% (568/684), 1.07 MiB | 1.21 MiB/s Receiving objects: 84% (575/684), 1.07 MiB | 1.21 MiB/s Receiving objects: 85% (582/684), 1.07 MiB | 1.21 MiB/s Receiving objects: 86% (589/684), 1.07 MiB | 1.21 MiB/s Receiving objects: 87% (596/684), 1.07 MiB | 1.21 MiB/s Receiving objects: 88% (602/684), 1.07 MiB | 1.21 MiB/s Receiving objects: 89% (609/684), 1.07 MiB | 1.21 MiB/s Receiving objects: 90% (616/684), 1.07 MiB | 1.21 MiB/s Receiving objects: 91% (623/684), 1.07 MiB | 1.21 MiB/s Receiving objects: 92% (630/684), 1.07 MiB | 1.21 MiB/s Receiving objects: 93% (637/684), 1.07 MiB | 1.21 MiB/s Receiving objects: 94% (643/684), 1.07 MiB | 1.21 MiB/s Receiving objects: 95% (650/684), 1.07 MiB | 1.21 MiB/s Receiving objects: 96% (657/684), 1.07 MiB | 1.21 MiB/s Receiving objects: 97% (664/684), 1.07 MiB | 1.21 MiB/s remote: Total 684 (delta 0), reused 684 (delta 0) Receiving objects: 98% (671/684), 1.07 MiB | 1.21 MiB/s Receiving objects: 99% (678/684), 1.07 MiB | 1.21 MiB/s Receiving objects: 100% (684/684), 1.07 MiB | 1.21 MiB/s Receiving objects: 100% (684/684), 3.04 MiB | 3.21 MiB/s, done.From https://diffinery.com/codician/diffinery * [new ref] c9968686398fb8e9fa997ae488944ce4164df93b -> origin/mainSwitched to a new branch 'main'HEAD is now at c9968686398fb8e9fa997ae488944ce4164df93b
Run pnpm/action-setup@b906affcce14559ad1aafd4ab0e942779e9f58b12s
Download action repository 'pnpm/action-setup@b906affcce14559ad1aafd4ab0e942779e9f58b1'##[group]Run pnpm/action-setup@b906affcce14559ad1aafd4ab0e942779e9f58b1with: dest: ~/setup-pnpm run_install: null cache: false cache_dependency_path: pnpm-lock.yaml package_json_file: package.json standalone: false##[endgroup]##[group]Running self-installer...Progress: resolved 1, reused 0, downloaded 0, added 0Packages: +1+Progress: resolved 1, reused 0, downloaded 1, added 1, donedependencies:+ pnpm 10.28.0 (12.14.0 is available)Done in 1.2s##[endgroup]Installation Completed!
Run actions/setup-node@v46s
##[group]Run actions/setup-node@v4with: node-version: 22 cache: pnpm##[endgroup]Found in cache @ 22.22.0 (pre-installed node satisfies '22')Cache Size: ~216 MB (226493609 B)Cache restored from key: node-cache-Linux-x64-pnpm-a02ba8dce5cb7329b868883337d1a03f862819a15859861dae22d3a8b1092f41
Run pnpm install --frozen-lockfile4s
##[group]Run pnpm install --frozen-lockfile##[endgroup]Scope: all 8 workspace projectsLockfile is up to date, resolution step is skippedProgress: resolved 1, reused 0, downloaded 0, added 0Packages: +250++++++++++++++++++++++++++++++++++++++++++++++++++++++++++++++++++++++++++++++++Progress: resolved 250, reused 244, downloaded 0, added 212Progress: resolved 250, reused 244, downloaded 0, added 250, done.../esbuild@0.28.1/node_modules/esbuild postinstall$ node install.js.../esbuild@0.25.11/node_modules/esbuild postinstall$ node install.js.../node_modules/workerd postinstall$ node install.js.../node_modules/workerd postinstall$ node install.js.../esbuild@0.25.12/node_modules/esbuild postinstall$ node install.js.../esbuild@0.28.1/node_modules/esbuild postinstall: Done.../esbuild@0.28.2/node_modules/esbuild postinstall$ node install.js.../node_modules/workerd postinstall: Done.../esbuild@0.25.11/node_modules/esbuild postinstall: Done.../node_modules/workerd postinstall: Done.../esbuild@0.28.2/node_modules/esbuild postinstall: Done.../esbuild@0.25.12/node_modules/esbuild postinstall: DonedevDependencies:+ turbo 2.11.7+ typescript 5.9.3Done in 3.3s using pnpm v10.28.0
Run pnpm -r --if-present build2s
##[group]Run pnpm -r --if-present build##[endgroup]Scope: 7 of 8 workspace projectsapps/cli build$ esbuild src/bin.ts --bundle --platform=node --target=node22 --format=esm --outfile=dist/diffinery.mjs "--banner:js=#!/usr/bin/env nodeimport { createRequire as __diffineryCreateRequire } from 'node:module'; const require = __diffineryCreateRequire(import.meta.url);"apps/diffinery build$ node islands/build.mjs && node scripts/build-docs.mjscontainers/runner build$ esbuild src/main.ts --bundle --platform=node --target=node22 --format=esm --outfile=dist/agent.mjs --external:bufferutil --external:utf-8-validate "--banner:js=import { createRequire as __diffineryCreateRequire } from 'node:module'; const require = __diffineryCreateRequire(import.meta.url);"apps/cli build: dist/diffinery.mjs 446.1kbapps/cli build: ⚡ Done in 67msapps/cli build: Donecontainers/runner build: dist/agent.mjs 682.1kbcontainers/runner build: ⚡ Done in 91mscontainers/runner build: Doneapps/diffinery build: islands: kumo.js 466 KB, kumo.css 149 KB, terminal.js 286 KBapps/diffinery build: docs: 72 pages (+2 generated at runtime), 6 images, CLI 0.1.0 (235 KiB), editor extension 0.1.1 (20 KiB)apps/diffinery build: Done
Run pnpm --filter @diffinery/app exec playwright install --with-deps chromium
Run as_root() { if [ "$(id -u)" = 0 ]; then "$@"; else sudo "$@"; fi; }
Run the shard's tests9m 27s
##[group]Run # Shards of similar length; a new test file runs in "rest" unless it's added to another.core='/e2e\.test\.mjs$'agents='/(agentic|review|tasks)\.test\.mjs$'security='/(security|status)\.test\.mjs$'# The core file's real histories and large pushes take minutes each (jquery's alone 2 to 3 on# Diffinery's runners): two shards of their own, so no part of the file runs into node's# per-file timeout, which is the --test-timeout here.histories='^real histories:'large='^(large files|large pushes):'opts=(--test-timeout=600000)case "histories" in core) files=$(ls test/e2e/*.test.mjs | grep -E "$core"); opts+=(--test-skip-pattern="$histories" --test-skip-pattern="$large") ;; histories) files=$(ls test/e2e/*.test.mjs | grep -E "$core"); opts=(--test-timeout=900000 --test-name-pattern="$histories") ;; large) files=$(ls test/e2e/*.test.mjs | grep -E "$core"); opts+=(--test-name-pattern="$large") ;; agents) files=$(ls test/e2e/*.test.mjs | grep -E "$agents") ;; security) files=$(ls test/e2e/*.test.mjs | grep -E "$security") ;; *) files=$(ls test/e2e/*.test.mjs | grep -vE "$core|$agents|$security") ;;esacecho "$files"node --test --test-concurrency=1 "${opts[@]}" $files##[endgroup]test/e2e/e2e.test.mjsTAP version 13# Subtest: real histories: whole projects, side by side # Subtest: real histories: jquery's whole history goes in one push and clones back intact not ok 1 - real histories: jquery's whole history goes in one push and clones back intact --- duration_ms: 501158.096566 type: 'test' location: '/workspace/diffinery/apps/diffinery/test/e2e/e2e.test.mjs:2872:5' failureType: 'testCodeFailure' error: |- git -c http.postBuffer=1048576 push -q -o allow-secrets=e2e of a public history http://127.0.0.1:40965/dev/jquery.git main exited 1 error: RPC failed; HTTP 500 curl 22 The requested URL returned error: 500 send-pack: unexpected disconnect while reading sideband packet fatal: the remote end hung up unexpectedly --- wrangler log tail --- ULE_TICK_MINUTES ("(hidden)") Environment Variable local ⎔ Starting local server... ⎔ Connection status updated Your Worker has access to the following bindings: Binding Resource Mode env.REPO (RepoDO) Durable Object local env.SCHEDULER (SchedulerDO) Durable Object local env.COMPOSE (ComposeDO) Durable Object local env.RUNNER (RunnerContainer) Durable Object local env.RUNNER_MEDIUM (RunnerContainerMedium) Durable Object local env.RUNNER_SMALL (RunnerContainerSmall) Durable Object local env.RUNNER_TINY (RunnerContainerTiny) Durable Object local env.SANDBOX (SandboxPoolDO) Durable Object local env.IMPORTER (ImportContainer) Durable Object local env.PROJECT (ProjectDO) Durable Object local env.RUN_WORKFLOW (RunWorkflow) Workflow local env.IMPORT_WORKFLOW (ImportWorkflow) Workflow local env.ACCOUNT_WORKFLOW (AccountWorkflow) Workflow local env.EMAIL (unrestricted) Send Email local env.EVENTS (diffinery-events-dev) Queue local env.MAIL (diffinery-mail-dev) Queue local env.DB (diffinery-dev) D1 Database local env.BUCKET (diffinery-data-dev) R2 Bucket local env.PUBLIC_URL ("(hidden)") Environment Variable local env.MAIL_FROM ("notifications@diffinery.com") Environment Variable local env.BOOTSTRAP_ADMINS ("dev@diffinery.local") Environment Variable local env.ACCESS_TEAM_DOMAIN ("") Environment Variable local env.ACCESS_AUD ("") Environment Variable local env.DEV_AUTH ("dev@diffinery.local") Environment Variable local env.IMPORT_GIT_AGENT ("external") Environment Variable local env.MASTER_KEY ("(hidden)") Environment Variable local env.SCHEDULE_TICK_MINUTES ("(hidden)") Environment Variable local [wrangler:info] Ready on http://127.0.0.1:40965 [wrangler:info] GET /healthz 200 OK (4393ms) [wrangler:info] POST /api/v3/diffinery/tokens 201 Created (34ms) [wrangler:info] GET /api/v3/user 200 OK (10ms) [wrangler:info] POST /api/v3/user/repos 201 Created (115ms) [wrangler:info] GET /dev/jquery.git/info/refs 200 OK (23ms) [wrangler:info] POST /dev/jquery.git/git-receive-pack 200 OK (27ms) [wrangler:info] QUEUE diffinery-mail-dev 1/1 (279ms) [wrangler:info] send_email binding called with MessageBuilder: From: "Diffinery" <notifications@diffinery.com> To: dev@diffinery.local Subject: [Diffinery] A personal access token was added to your account Text: /workspace/diffinery/apps/diffinery/.wrangler/tmp/email/miniflare-1d4ce5d680a546195d7b852b8616ad3f/email-text/QRKAAItevh6gKPxR6egj8syHrtdtl8sYM4uY@diffinery.com.txt HTML: /workspace/diffinery/apps/diffinery/.wrangler/tmp/email/miniflare-1d4ce5d680a546195d7b852b8616ad3f/email-html/QRKAAItevh6gKPxR6egj8syHrtdtl8sYM4uY@diffinery.com.html [wrangler:warn] The Workers runtime crashed unexpectedly and is being restarted (crash #1). Any additional runtime output above may indicate the cause. code: 'ERR_TEST_FAILURE' stack: |- ChildProcess.<anonymous> (file:///workspace/diffinery/apps/diffinery/test/e2e/e2e.test.mjs:2830:26) ChildProcess.emit (node:events:519:28) maybeClose (node:internal/child_process:1101:16) ChildProcess._handle.onexit (node:internal/child_process:304:5) ... # Subtest: real histories: tornado's whole history goes in one push and clones back intact ok 2 - real histories: tornado's whole history goes in one push and clones back intact --- duration_ms: 544065.884549 type: 'test' ... # Subtest: real histories: flask's whole history goes in one push and clones back intact ok 3 - real histories: flask's whole history goes in one push and clones back intact --- duration_ms: 538166.076055 type: 'test' ... # Subtest: real histories: a 2.6 MB lockfile's 60 versions, a chain of deltas, go in one small push ok 4 - real histories: a 2.6 MB lockfile's 60 versions, a chain of deltas, go in one small push --- duration_ms: 515904.806609 type: 'test' ... 1..4not ok 1 - real histories: whole projects, side by side --- duration_ms: 564637.455523 type: 'suite' location: '/workspace/diffinery/apps/diffinery/test/e2e/e2e.test.mjs:2864:1' failureType: 'subtestsFailed' error: '1 subtest failed' code: 'ERR_TEST_FAILURE' ...1..1# tests 4# suites 1# pass 3# fail 1# cancelled 0# skipped 0# todo 0# duration_ms 566866.425714##[error]Process completed with exit code 1.
Post Run pnpm/action-setup@b906affcce14559ad1aafd4ab0e942779e9f58b10s
Pruning is unnecessary.Post Run actions/checkout@v40s
Removing persisted credentials