Unit tests (1/2)
took 2m 1s Raw logs
Matrix: shard: 1
Failed at Unit tests
Process completed with exit code 1.
containers/runner test: [31m+ Received:[39m
containers/runner test: null
containers/runner test: [36m [2m❯[22m test/docker-wrapper.test.ts:[2m142:32[22m[39m
containers/runner test: [90m140|[39m const env = { ...process.env, PATH: `${bin}:${process.env.PATH}`, …
containers/runner test: [90m141|[39m const r = spawnSync("bash", ["-c", "docker version"], { env, encod…
containers/runner test: [90m142|[39m [34mexpect[39m(r[33m.[39mstatus[33m,[39m r[33m.[39mstderr)[33m.[39m[34mtoBe[39m([34m0[39m)[33m;[39m
containers/runner test: [90m |[39m [31m^[39m
containers/runner test: [90m143|[39m [34mexpect[39m(r[33m.[39mstdout)[33m.[39m[34mtoContain[39m([32m"docker version"[39m)[33m;[39m
containers/runner test: [90m144|[39m [34mexpect[39m(r[33m.[39mstderr)[33m.[39m[34mtoContain[39m([32m"The registry relay did not start"[39m)[33m;[39m
containers/runner test: [31m[2m⎯⎯⎯⎯⎯⎯⎯⎯⎯⎯⎯⎯⎯⎯⎯⎯⎯⎯⎯⎯⎯⎯⎯⎯[1/1]⎯[22m[39m
containers/runner test: [2m Test Files [22m [1m[31m1 failed[39m[22m[2m | [22m[1m[32m5 passed[39m[22m[90m (6)[39m
containers/runner test: [2m Tests [22m [1m[31m1 failed[39m[22m[2m | [22m[1m[32m42 passed[39m[22m[90m (43)[39m
containers/runner test: [2m Start at [22m 17:45:40
containers/runner test: [2m Duration [22m 52.48s[2m (transform 3.29s, setup 0ms, import 13.02s, tests 81.68s, environment 1ms)[22m
containers/runner test: ::error file=/workspace/diffinery/containers/runner/test/docker-wrapper.test.ts,title=test/docker-wrapper.test.ts > docker wrapper > starts the daemon again without the relay when the relay never comes up,line=142,column=32::AssertionError: Starting the Docker daemon%0AThe registry relay did not start, so image layers over 100 MB can't be pushed to diffinery.test:%0A: expected null to be +0 // Object.is equality%0A%0A- Expected:%0A0%0A%0A+ Received:%0Anull%0A%0A ❯ test/docker-wrapper.test.ts:142:32%0A%0A
containers/runner test: Failed
/workspace/diffinery/containers/runner:
ERR_PNPM_RECURSIVE_RUN_FIRST_FAIL @diffinery/runner@0.1.0 test: `vitest run --shard=1/2`
Exit status 1Set up job
Diffinery runner: job test (Unit tests (1/2)) for codician/diffinery@a6942d113c8eRunner: image diffinery-runner:0ab022e0ba2c8e3fc4b10dbe, in ams15, WEUR, container e1db432bc4e0ddfdb203ab48e2997426a5132246363025b747c9a129225edf46Runner size: large (4 vCPU, 12 GiB of memory, 20 GB of disk), this job uses what a smaller runner doesn't have; runs-on: diffinery-large (or -medium, -small, -tiny) sets a sizeHost: AMD EPYC (family 25, model 1), 4 vCPUs, 2000 MHzWorkspace: /workspace/diffineryHost: 8% of the vCPUs' time went to other work on the host (steal)Job completed with conclusion: failureResources: 1.7 of 4 vCPUs busy on average (3.8 at the 95th percentile), peak memory 1.9 GiB of 11.9 GiB, peak disk 2.3 GB of 19.3 GB
Run actions/checkout@v42s
##[group]Run actions/checkout@v4##[endgroup]Syncing repository: codician/diffineryFetching the repository (depth 1)remote: Enumerating objects: 682, done. Receiving objects: 0% (1/682) Receiving objects: 1% (7/682) Receiving objects: 2% (14/682) Receiving objects: 3% (21/682) Receiving objects: 4% (28/682) Receiving objects: 5% (35/682) Receiving objects: 6% (41/682) Receiving objects: 7% (48/682) Receiving objects: 8% (55/682) Receiving objects: 9% (62/682) Receiving objects: 10% (69/682) Receiving objects: 11% (76/682) Receiving objects: 12% (82/682) Receiving objects: 13% (89/682) Receiving objects: 14% (96/682) Receiving objects: 15% (103/682) Receiving objects: 16% (110/682) Receiving objects: 17% (116/682) Receiving objects: 18% (123/682) Receiving objects: 19% (130/682) Receiving objects: 20% (137/682) Receiving objects: 21% (144/682) Receiving objects: 22% (151/682) Receiving objects: 23% (157/682) Receiving objects: 24% (164/682) Receiving objects: 25% (171/682) Receiving objects: 26% (178/682) Receiving objects: 27% (185/682) Receiving objects: 28% (191/682) Receiving objects: 29% (198/682) Receiving objects: 30% (205/682) Receiving objects: 31% (212/682) Receiving objects: 32% (219/682) Receiving objects: 33% (226/682) Receiving objects: 34% (232/682) Receiving objects: 35% (239/682) Receiving objects: 36% (246/682) Receiving objects: 37% (253/682) Receiving objects: 38% (260/682) Receiving objects: 39% (266/682) Receiving objects: 40% (273/682) Receiving objects: 41% (280/682) Receiving objects: 42% (287/682) Receiving objects: 43% (294/682) Receiving objects: 44% (301/682) Receiving objects: 45% (307/682) Receiving objects: 46% (314/682) Receiving objects: 47% (321/682) Receiving objects: 48% (328/682) Receiving objects: 49% (335/682) Receiving objects: 50% (341/682) Receiving objects: 51% (348/682) Receiving objects: 52% (355/682) Receiving objects: 53% (362/682) Receiving objects: 54% (369/682) Receiving objects: 55% (376/682) Receiving objects: 56% (382/682) Receiving objects: 57% (389/682) Receiving objects: 58% (396/682) Receiving objects: 59% (403/682) Receiving objects: 60% (410/682), 2.22 MiB | 4.44 MiB/s Receiving objects: 61% (417/682), 2.22 MiB | 4.44 MiB/s Receiving objects: 62% (423/682), 2.22 MiB | 4.44 MiB/s Receiving objects: 63% (430/682), 2.22 MiB | 4.44 MiB/s Receiving objects: 64% (437/682), 2.22 MiB | 4.44 MiB/s Receiving objects: 65% (444/682), 2.22 MiB | 4.44 MiB/s Receiving objects: 66% (451/682), 2.22 MiB | 4.44 MiB/s Receiving objects: 67% (457/682), 2.22 MiB | 4.44 MiB/s Receiving objects: 68% (464/682), 2.22 MiB | 4.44 MiB/s Receiving objects: 69% (471/682), 2.22 MiB | 4.44 MiB/s Receiving objects: 70% (478/682), 2.22 MiB | 4.44 MiB/s Receiving objects: 71% (485/682), 2.22 MiB | 4.44 MiB/s Receiving objects: 72% (492/682), 2.22 MiB | 4.44 MiB/s Receiving objects: 73% (498/682), 2.22 MiB | 4.44 MiB/s Receiving objects: 74% (505/682), 2.22 MiB | 4.44 MiB/s Receiving objects: 75% (512/682), 2.22 MiB | 4.44 MiB/s Receiving objects: 76% (519/682), 2.22 MiB | 4.44 MiB/s Receiving objects: 77% (526/682), 2.22 MiB | 4.44 MiB/s Receiving objects: 78% (532/682), 2.22 MiB | 4.44 MiB/s Receiving objects: 79% (539/682), 2.22 MiB | 4.44 MiB/s Receiving objects: 80% (546/682), 2.22 MiB | 4.44 MiB/s Receiving objects: 81% (553/682), 2.22 MiB | 4.44 MiB/s Receiving objects: 82% (560/682), 2.22 MiB | 4.44 MiB/s Receiving objects: 83% (567/682), 2.22 MiB | 4.44 MiB/s Receiving objects: 84% (573/682), 2.22 MiB | 4.44 MiB/s Receiving objects: 85% (580/682), 2.22 MiB | 4.44 MiB/s Receiving objects: 86% (587/682), 2.22 MiB | 4.44 MiB/s Receiving objects: 87% (594/682), 2.22 MiB | 4.44 MiB/s Receiving objects: 88% (601/682), 2.22 MiB | 4.44 MiB/s Receiving objects: 89% (607/682), 2.22 MiB | 4.44 MiB/s Receiving objects: 90% (614/682), 2.22 MiB | 4.44 MiB/s Receiving objects: 91% (621/682), 2.22 MiB | 4.44 MiB/s Receiving objects: 92% (628/682), 2.22 MiB | 4.44 MiB/s Receiving objects: 93% (635/682), 2.22 MiB | 4.44 MiB/s Receiving objects: 94% (642/682), 2.22 MiB | 4.44 MiB/s Receiving objects: 95% (648/682), 2.22 MiB | 4.44 MiB/s Receiving objects: 96% (655/682), 2.22 MiB | 4.44 MiB/s Receiving objects: 97% (662/682), 2.22 MiB | 4.44 MiB/s remote: Total 682 (delta 0), reused 682 (delta 0) Receiving objects: 98% (669/682), 2.22 MiB | 4.44 MiB/s Receiving objects: 99% (676/682), 2.22 MiB | 4.44 MiB/s Receiving objects: 100% (682/682), 2.22 MiB | 4.44 MiB/s Receiving objects: 100% (682/682), 3.03 MiB | 5.42 MiB/s, done.From https://diffinery.com/codician/diffinery * [new ref] a6942d113c8eff9194c0a12d85081101ab68c08b -> origin/diffinery-checkoutNote: switching to 'a6942d113c8eff9194c0a12d85081101ab68c08b'.You are in 'detached HEAD' state. You can look around, make experimentalchanges and commit them, and you can discard any commits you make in thisstate without impacting any branches by switching back to a branch.If you want to create a new branch to retain commits you create, you maydo so (now or later) by using -c with the switch command. Example: git switch -c <new-branch-name>Or undo this operation with: git switch -Turn off this advice by setting config variable advice.detachedHead to falseHEAD is now at a6942d1 Merge d65feff95d82c67cdfff69efc4c03a1cc9f6f16b into 92a47952f2e99bfac718d840316495720dc8cd57HEAD is now at a6942d113c8eff9194c0a12d85081101ab68c08b
Run pnpm/action-setup@b906affcce14559ad1aafd4ab0e942779e9f58b15s
Download action repository 'pnpm/action-setup@b906affcce14559ad1aafd4ab0e942779e9f58b1'##[group]Run pnpm/action-setup@b906affcce14559ad1aafd4ab0e942779e9f58b1with: dest: ~/setup-pnpm run_install: null cache: false cache_dependency_path: pnpm-lock.yaml package_json_file: package.json standalone: false##[endgroup]##[group]Running self-installer...Progress: resolved 1, reused 0, downloaded 0, added 0Packages: +1+Progress: resolved 1, reused 0, downloaded 1, added 0Progress: resolved 1, reused 0, downloaded 1, added 1, donedependencies:+ pnpm 10.28.0 (12.14.0 is available)Done in 3s##[endgroup]Installation Completed!
Run actions/setup-node@v412s
##[group]Run actions/setup-node@v4with: node-version: 22 cache: pnpm##[endgroup]Found in cache @ 22.22.0 (pre-installed node satisfies '22')Cache Size: ~216 MB (226493609 B)Cache restored from key: node-cache-Linux-x64-pnpm-a02ba8dce5cb7329b868883337d1a03f862819a15859861dae22d3a8b1092f41
Run pnpm install --frozen-lockfile7s
##[group]Run pnpm install --frozen-lockfile##[endgroup]Scope: all 8 workspace projectsLockfile is up to date, resolution step is skippedProgress: resolved 1, reused 0, downloaded 0, added 0Packages: +250++++++++++++++++++++++++++++++++++++++++++++++++++++++++++++++++++++++++++++++++Progress: resolved 250, reused 244, downloaded 0, added 32Progress: resolved 250, reused 244, downloaded 0, added 213Progress: resolved 250, reused 244, downloaded 0, added 250, done.../esbuild@0.25.12/node_modules/esbuild postinstall$ node install.js.../node_modules/workerd postinstall$ node install.js.../esbuild@0.25.11/node_modules/esbuild postinstall$ node install.js.../esbuild@0.28.1/node_modules/esbuild postinstall$ node install.js.../node_modules/workerd postinstall$ node install.js.../esbuild@0.25.12/node_modules/esbuild postinstall: Done.../esbuild@0.28.2/node_modules/esbuild postinstall$ node install.js.../node_modules/workerd postinstall: Done.../node_modules/workerd postinstall: Done.../esbuild@0.25.11/node_modules/esbuild postinstall: Done.../esbuild@0.28.1/node_modules/esbuild postinstall: Done.../esbuild@0.28.2/node_modules/esbuild postinstall: DonedevDependencies:+ turbo 2.11.7+ typescript 5.9.3Done in 6.6s using pnpm v10.28.0
Build5s
##[group]Run pnpm -r --if-present build##[endgroup]Scope: 7 of 8 workspace projectsapps/cli build$ esbuild src/bin.ts --bundle --platform=node --target=node22 --format=esm --outfile=dist/diffinery.mjs "--banner:js=#!/usr/bin/env nodeimport { createRequire as __diffineryCreateRequire } from 'node:module'; const require = __diffineryCreateRequire(import.meta.url);"apps/diffinery build$ node islands/build.mjs && node scripts/build-docs.mjscontainers/runner build$ esbuild src/main.ts --bundle --platform=node --target=node22 --format=esm --outfile=dist/agent.mjs --external:bufferutil --external:utf-8-validate "--banner:js=import { createRequire as __diffineryCreateRequire } from 'node:module'; const require = __diffineryCreateRequire(import.meta.url);"apps/cli build: dist/diffinery.mjs 446.1kbapps/cli build: ⚡ Done in 207mscontainers/runner build: dist/agent.mjs 674.1kbcontainers/runner build: ⚡ Done in 201msapps/cli build: Donecontainers/runner build: Doneapps/diffinery build: islands: kumo.js 466 KB, kumo.css 149 KB, terminal.js 286 KBapps/diffinery build: docs: 72 pages (+2 generated at runtime), 6 images, CLI 0.1.0 (235 KiB), editor extension 0.1.0 (20 KiB)apps/diffinery build: Done
Unit tests1m 29s
##[group]Run pnpm -r --if-present run test --shard=1/2##[endgroup]Scope: 7 of 8 workspace projectsapps/vscode test$ vitest run --shard=1/2packages/git-core test$ vitest run --shard=1/2packages/workflow-yaml test$ vitest run --shard=1/2packages/git-core test: (!) Your Vite config uses features that are unsupported by `configLoader: 'native'`, which is planned to become the default in a future major version of Vite:packages/git-core test: - import "../../vitest.shared" without a file extension (vitest.config.ts:2:26). Add the file extensionpackages/git-core test: - ESM syntax in a file loaded as CommonJS (../../vitest.shared.ts:10:1). Use a `.mjs` extension or set `"type": "module"` in the closest package.jsonpackages/git-core test: Set `VITE_CONFIG_NATIVE_IGNORE_WARNING=true` to suppress this warning.packages/git-core test: RUN v4.1.11 /workspace/diffinery/packages/git-coreapps/vscode test: (!) Your Vite config uses features that are unsupported by `configLoader: 'native'`, which is planned to become the default in a future major version of Vite:apps/vscode test: - ESM syntax in a file loaded as CommonJS (vitest.config.ts:1:1). Use a `.mjs` extension or set `"type": "module"` in the closest package.jsonapps/vscode test: - ESM syntax in a file loaded as CommonJS (../../vitest.shared.ts:10:1). Use a `.mjs` extension or set `"type": "module"` in the closest package.jsonapps/vscode test: Set `VITE_CONFIG_NATIVE_IGNORE_WARNING=true` to suppress this warning.packages/workflow-yaml test: (!) Your Vite config uses features that are unsupported by `configLoader: 'native'`, which is planned to become the default in a future major version of Vite:packages/workflow-yaml test: - import "../../vitest.shared" without a file extension (vitest.config.ts:2:26). Add the file extensionpackages/workflow-yaml test: - ESM syntax in a file loaded as CommonJS (../../vitest.shared.ts:10:1). Use a `.mjs` extension or set `"type": "module"` in the closest package.jsonpackages/workflow-yaml test: Set `VITE_CONFIG_NATIVE_IGNORE_WARNING=true` to suppress this warning.apps/vscode test: RUN v4.1.11 /workspace/diffinery/apps/vscodepackages/workflow-yaml test: RUN v4.1.11 /workspace/diffinery/packages/workflow-yamlapps/vscode test: ✓ test/repos.test.ts (6 tests) 20msapps/vscode test: Test Files 1 passed (1)apps/vscode test: Tests 6 passed (6)apps/vscode test: Start at 17:45:09apps/vscode test: Duration 930ms (transform 154ms, setup 0ms, import 227ms, tests 20ms, environment 0ms)apps/vscode test: Donepackages/git-core test: ✓ test/pack-stream.test.ts (3 tests) 596mspackages/git-core test: ✓ is byte for byte the pack writePack builds, and reads one entry at a time 502mspackages/workflow-yaml test: ✓ test/expr.test.ts (48 tests) 126mspackages/workflow-yaml test: ✓ test/cron.test.ts (23 tests) 251mspackages/workflow-yaml test: ✓ test/parse.test.ts (31 tests) 386mspackages/workflow-yaml test: Test Files 3 passed (3)packages/workflow-yaml test: Tests 102 passed (102)packages/workflow-yaml test: Start at 17:45:09packages/workflow-yaml test: Duration 2.31s (transform 1.92s, setup 0ms, import 3.12s, tests 763ms, environment 1ms)packages/workflow-yaml test: Donepackages/git-core test: ✓ test/diff-budget.test.ts (5 tests) 1787mspackages/git-core test: ✓ a file rewritten from scratch is diffed in one pass, as one replaced block 686mspackages/git-core test: ✓ a three-way merge too large to compute is a conflict, quickly 1059mspackages/git-core test: ✓ test/pack-limits.test.ts (6 tests) 28581mspackages/git-core test: ✓ resolves a long delta chain in one pass, whatever order the pack lists it in 18328mspackages/git-core test: ✓ counts what each object costs in memory, not only its content 7322mspackages/git-core test: ✓ refuses a small pack whose objects inflate past the memory budget 2856mspackages/git-core test: Test Files 3 passed (3)packages/git-core test: Tests 14 passed (14)packages/git-core test: Start at 17:45:09packages/git-core test: Duration 30.24s (transform 2.28s, setup 0ms, import 3.21s, tests 30.96s, environment 1ms)packages/git-core test: Doneapps/cli test$ vitest run --shard=1/2apps/diffinery test$ vitest run --passWithNoTests --exclude 'test/e2e/**' --shard=1/2containers/runner test$ vitest run --shard=1/2apps/cli test: (!) Your Vite config uses features that are unsupported by `configLoader: 'native'`, which is planned to become the default in a future major version of Vite:apps/cli test: - import "../../vitest.shared" without a file extension (vitest.config.ts:2:26). Add the file extensionapps/cli test: - ESM syntax in a file loaded as CommonJS (../../vitest.shared.ts:10:1). Use a `.mjs` extension or set `"type": "module"` in the closest package.jsonapps/cli test: Set `VITE_CONFIG_NATIVE_IGNORE_WARNING=true` to suppress this warning.apps/diffinery test: (!) Your Vite config uses features that are unsupported by `configLoader: 'native'`, which is planned to become the default in a future major version of Vite:apps/diffinery test: - import "../../vitest.shared" without a file extension (vitest.config.ts:3:26). Add the file extensionapps/diffinery test: - ESM syntax in a file loaded as CommonJS (../../vitest.shared.ts:10:1). Use a `.mjs` extension or set `"type": "module"` in the closest package.jsonapps/diffinery test: Set `VITE_CONFIG_NATIVE_IGNORE_WARNING=true` to suppress this warning.apps/cli test: RUN v4.1.11 /workspace/diffinery/apps/cliapps/diffinery test: RUN v4.1.11 /workspace/diffinery/apps/diffinerycontainers/runner test: (!) Your Vite config uses features that are unsupported by `configLoader: 'native'`, which is planned to become the default in a future major version of Vite:containers/runner test: - import "../../vitest.shared" without a file extension (vitest.config.ts:2:26). Add the file extensioncontainers/runner test: - ESM syntax in a file loaded as CommonJS (../../vitest.shared.ts:10:1). Use a `.mjs` extension or set `"type": "module"` in the closest package.jsoncontainers/runner test: Set `VITE_CONFIG_NATIVE_IGNORE_WARNING=true` to suppress this warning.containers/runner test: RUN v4.1.11 /workspace/diffinery/containers/runnerapps/diffinery test: (node:516) ExperimentalWarning: SQLite is an experimental feature and might change at any timeapps/diffinery test: (Use `node --trace-warnings ...` to show where the warning was created)apps/diffinery test: (node:522) ExperimentalWarning: SQLite is an experimental feature and might change at any timeapps/diffinery test: (Use `node --trace-warnings ...` to show where the warning was created)apps/diffinery test: ✓ test/unit/usage.test.ts (23 tests) 320mscontainers/runner test: ✓ test/jail.test.ts (12 tests) 490msapps/cli test: ✓ test/login.test.ts (12 tests) 1293msapps/cli test: ✓ opens the authorize page with a PKCE challenge, trades the code with the verifier, and saves the token 552mscontainers/runner test: ✓ test/relay.test.ts (4 tests) 2171mscontainers/runner test: ✓ splits a single-PUT upload (containerd) into PATCH chunks under the limit 866mscontainers/runner test: ✓ answers a streamed PATCH (docker) like the registry would, then completes with an empty PUT 990msapps/diffinery test: (node:568) ExperimentalWarning: SQLite is an experimental feature and might change at any timeapps/diffinery test: (Use `node --trace-warnings ...` to show where the warning was created)apps/cli test: ✓ test/pr.test.ts (19 tests) 3247msapps/cli test: ✓ pr view, checks, diff, comment, review, ready and merge default to the current branch's pull request 615msapps/cli test: ✓ pr checks --watch waits for the first check right after a push, and gives up after 2 minutes 1003msapps/cli test: ✓ test/migrate.test.ts (4 tests) 3540msapps/cli test: ✓ creates the repo, pushes branches and tags, and copies issues, PRs, variables and secret names 1339msapps/cli test: ✓ repo clone authenticates for that command only 938msapps/cli test: ✓ without --local, starts a server import and follows it to completion 370msapps/cli test: ✓ --private and --to override the target 885msapps/cli test: ✓ test/misc.test.ts (9 tests) 775msapps/cli test: Test Files 4 passed (4)apps/cli test: Tests 44 passed (44)apps/cli test: Start at 17:45:40apps/cli test: Duration 7.18s (transform 3.99s, setup 0ms, import 7.63s, tests 8.86s, environment 1ms)apps/cli test: Doneapps/diffinery test: stderr | test/unit/suppression.test.ts > Email Sending's answer to a send > puts a refused recipient on the list (source send) and audits it; temporary failures change nothingapps/diffinery test: email failed test Ann@Example.com E_RECIPIENT_SUPPRESSED: recipient is suppressedapps/diffinery test: stderr | test/unit/suppression.test.ts > Email Sending's answer to a send > puts a refused recipient on the list (source send) and audits it; temporary failures change nothingapps/diffinery test: email failed test bob@example.com E_DAILY_LIMIT_EXCEEDED: nopeapps/diffinery test: ✓ test/unit/suppression.test.ts (11 tests) 1309msapps/diffinery test: ✓ sends nothing to a suppressed address, security and sign-in email included, whatever its case 348msapps/diffinery test: ✓ test/unit/runner-sizes.test.ts (19 tests) 1182msapps/diffinery test: ✓ runs a first job large, then sizes it by what it used 573mscontainers/runner test: ✓ test/runtime.test.ts (12 tests) 4454mscontainers/runner test: ✓ writes archives unzip reads, and reads archives zip writes 561mscontainers/runner test: ✓ uploads large files as blocks, small ones in one request, and downloads them back 3102mscontainers/runner test: ✓ downloads in ranges, several at once, retrying a range on its own 612msapps/diffinery test: (node:1211) ExperimentalWarning: SQLite is an experimental feature and might change at any timeapps/diffinery test: (Use `node --trace-warnings ...` to show where the warning was created)apps/diffinery test: ✓ test/unit/review.test.ts (19 tests) 132msapps/diffinery test: stderr | test/unit/moderation.test.ts > suspension > refuses tokens and sessions at once, stops Actions, and unsuspending restores the tokensapps/diffinery test: mail queue not bound; dropping 1 email(s)apps/diffinery test: stderr | test/unit/moderation.test.ts > suspension > refuses tokens and sessions at once, stops Actions, and unsuspending restores the tokensapps/diffinery test: mail queue not bound; dropping 1 email(s)apps/diffinery test: ✓ test/unit/moderation.test.ts (9 tests) 559msapps/diffinery test: (node:1391) ExperimentalWarning: SQLite is an experimental feature and might change at any timeapps/diffinery test: (Use `node --trace-warnings ...` to show where the warning was created)apps/diffinery test: (node:1427) ExperimentalWarning: SQLite is an experimental feature and might change at any timeapps/diffinery test: (Use `node --trace-warnings ...` to show where the warning was created)apps/diffinery test: ✓ test/unit/rerun.test.ts (10 tests) 3206msapps/diffinery test: ✓ keeps the legs that passed and re-runs the failed and cancelled ones, with what depends on them 753msapps/diffinery test: ✓ refuses a run without failed jobs, and one that hasn't finished 436msapps/diffinery test: ✓ starts up to max-parallel re-run legs; kept legs don't count 372msapps/diffinery test: ✓ re-runs that job and its dependents and keeps the rest, failures included 309msapps/diffinery test: ✓ serves a kept job's log from the job that ran 471msapps/diffinery test: stderr | test/unit/stuck-runs.test.ts > runs stuck after their jobs finished > a lost job event is sent again, so the run's workflow carries on and the next run in the group startsapps/diffinery test: failed to notify workflow Error: network connection lostapps/diffinery test: at Object.sendEvent (/workspace/diffinery/apps/diffinery/test/unit/stuck-runs.test.ts:85:31)apps/diffinery test: at Actions.completeJob (/workspace/diffinery/apps/diffinery/src/repo/actions.ts:2529:22)apps/diffinery test: at Object.runTest (/workspace/diffinery/apps/diffinery/test/unit/stuck-runs.test.ts:102:5)apps/diffinery test: at /workspace/diffinery/apps/diffinery/test/unit/stuck-runs.test.ts:119:5apps/diffinery test: at async file:///workspace/diffinery/node_modules/.pnpm/@vitest+runner@4.1.11/node_modules/@vitest/runner/dist/chunk-artifact.js:1903:20apps/diffinery test: stderr | test/unit/stuck-runs.test.ts > runs stuck after their jobs finished > a lost job event is sent again, so the run's workflow carries on and the next run in the group startsapps/diffinery test: run stuck after its jobs finished: sending their completion events again 252adc3b1fc7484c8ba867679b61ad02 waitingapps/diffinery test: stderr | test/unit/stuck-runs.test.ts > runs stuck after their jobs finished > a run whose workflow failed is finished, failing and naming the jobs that never started; the late workflow changes nothingapps/diffinery test: run stuck after its jobs finished: finishing it 2b8273c90e284e0e882b5af08a80f23a erroredapps/diffinery test: ✓ test/unit/job-permissions.test.ts (8 tests) 60msapps/diffinery test: stderr | test/unit/stuck-runs.test.ts > runs stuck after their jobs finished > a run still stuck STUCK_RUN_FINISH_MS after its jobs finished is finished, though its workflow looks aliveapps/diffinery test: run stuck after its jobs finished: sending their completion events again fa5a9cb438aa4ae59a93492af6d9dec7 waitingapps/diffinery test: stderr | test/unit/stuck-runs.test.ts > runs stuck after their jobs finished > a run still stuck STUCK_RUN_FINISH_MS after its jobs finished is finished, though its workflow looks aliveapps/diffinery test: run stuck after its jobs finished: finishing it fa5a9cb438aa4ae59a93492af6d9dec7 waitingapps/diffinery test: stderr | test/unit/stuck-runs.test.ts > runs stuck after their jobs finished > a waiting run in the group repairs the stuck one when it plans: a cancelled run whose jobs ended long ago frees the groupapps/diffinery test: run stuck after its jobs finished: sending their completion events again d1f1a1402b734de7b743ba356aa31b8d waitingapps/diffinery test: stderr | test/unit/stuck-runs.test.ts > runs stuck after their jobs finished > a waiting run in the group repairs the stuck one when it plans: a cancelled run whose jobs ended long ago frees the groupapps/diffinery test: run stuck after its jobs finished: finishing it d1f1a1402b734de7b743ba356aa31b8d waitingapps/diffinery test: ✓ test/unit/auto-merge.test.ts (12 tests) 715msapps/diffinery test: ✓ test/unit/stuck-runs.test.ts (5 tests) 868msapps/diffinery test: stderr | test/unit/rate-limit.test.ts > rate limit checks > lets requests through when no limiter is configured or the limiter failsapps/diffinery test: rate limiter failed RL_ANON Error: downapps/diffinery test: at Object.limit (/workspace/diffinery/apps/diffinery/test/unit/rate-limit.test.ts:91:67)apps/diffinery test: at overLimit (/workspace/diffinery/apps/diffinery/src/lib/rate-limit.ts:72:22)apps/diffinery test: at /workspace/diffinery/apps/diffinery/test/unit/rate-limit.test.ts:92:18apps/diffinery test: at process.processTicksAndRejections (node:internal/process/task_queues:105:5)containers/runner test: ✓ test/import.test.ts (7 tests) 10613mscontainers/runner test: ✓ pushes history in chunks under a size limit the server enforces, then every ref, and cleans up 6167mscontainers/runner test: ✓ pushes every version of a large file first and whole, so the server never rebuilds one from a delta 2083mscontainers/runner test: ✓ splits a refused batch of a large commit's files again, rather than retrying it whole 2344msapps/diffinery test: ✓ test/unit/today.test.ts (10 tests) 42msapps/diffinery test: (node:1897) ExperimentalWarning: SQLite is an experimental feature and might change at any timeapps/diffinery test: (Use `node --trace-warnings ...` to show where the warning was created)apps/diffinery test: stderr | test/unit/killswitch.test.ts > kill switches > counts repositories that couldn't be stopped, and needs a reasonapps/diffinery test: kill switch: stopping work in repository broken failed Error: goneapps/diffinery test: at Object.stopActions (/workspace/diffinery/apps/diffinery/test/unit/killswitch.test.ts:24:36)apps/diffinery test: at worker (/workspace/diffinery/apps/diffinery/src/lib/killswitch.ts:155:63)apps/diffinery test: at Function.from (<anonymous>)apps/diffinery test: at stopIn (/workspace/diffinery/apps/diffinery/src/lib/killswitch.ts:166:27)apps/diffinery test: at changePause (/workspace/diffinery/apps/diffinery/src/lib/killswitch.ts:225:21)apps/diffinery test: at process.processTicksAndRejections (node:internal/process/task_queues:105:5)apps/diffinery test: at /workspace/diffinery/apps/diffinery/test/unit/killswitch.test.ts:123:12apps/diffinery test: at async file:///workspace/diffinery/node_modules/.pnpm/@vitest+runner@4.1.11/node_modules/@vitest/runner/dist/chunk-artifact.js:1903:20apps/diffinery test: ✓ test/unit/killswitch.test.ts (5 tests) 263msapps/diffinery test: ✓ test/unit/coordinator.test.ts (8 tests) 48msapps/diffinery test: ✓ test/unit/secret-scan.test.ts (7 tests) 2890msapps/diffinery test: ✓ scans large blobs from their compressed bytes, slice by slice, with the same rules 518msapps/diffinery test: ✓ scans a large file in slices, never as one string, with the same results 2345msapps/diffinery test: ✓ test/unit/job-graph.test.ts (12 tests) 111msapps/diffinery test: stderr | test/unit/rate-limit.test.ts > model requests per paying person (phase 5a) > counts per person, and lets requests through without a binding or when it failsapps/diffinery test: model rate limiter failed Error: downapps/diffinery test: at Object.limit (/workspace/diffinery/apps/diffinery/test/unit/rate-limit.test.ts:132:61)apps/diffinery test: at modelRateLimited (/workspace/diffinery/apps/diffinery/src/lib/rate-limit.ts:91:33)apps/diffinery test: at /workspace/diffinery/apps/diffinery/test/unit/rate-limit.test.ts:133:18apps/diffinery test: at process.processTicksAndRejections (node:internal/process/task_queues:105:5)apps/diffinery test: at async file:///workspace/diffinery/node_modules/.pnpm/@vitest+runner@4.1.11/node_modules/@vitest/runner/dist/chunk-artifact.js:1903:20apps/diffinery test: ✓ test/unit/rate-limit.test.ts (10 tests) 8846msapps/diffinery test: ✓ answers 429 with retry-after once an anonymous address is over its limit 8755msapps/diffinery test: ✓ test/unit/project.test.ts (12 tests) 48msapps/diffinery test: ✓ test/unit/markdown-safety.test.ts (31 tests) 1384msapps/diffinery test: ✓ renders many comment openers in linear time 505msapps/diffinery test: (node:2374) ExperimentalWarning: SQLite is an experimental feature and might change at any timeapps/diffinery test: (Use `node --trace-warnings ...` to show where the warning was created)apps/diffinery test: (node:2387) ExperimentalWarning: SQLite is an experimental feature and might change at any timeapps/diffinery test: (Use `node --trace-warnings ...` to show where the warning was created)apps/diffinery test: ✓ test/unit/visibility.test.ts (3 tests) 179msapps/diffinery test: ✓ test/unit/job-token.test.ts (7 tests) 212msapps/diffinery test: ✓ test/unit/reusable.test.ts (4 tests) 50msapps/diffinery test: ✓ test/unit/deploy-log-notes.test.ts (2 tests) 94msapps/diffinery test: ✓ test/unit/required.test.ts (11 tests) 26msapps/diffinery test: ✓ test/unit/fsck.test.ts (16 tests) 1020msapps/diffinery test: ✓ refuses a tree too large to check, before reading its names 974msapps/diffinery test: ✓ test/unit/redirects.test.ts (9 tests) 17msapps/diffinery test: ✓ test/unit/registry-upload.test.ts (2 tests) 1235msapps/diffinery test: ✓ hash each chunk as it arrives, so the final request doesn't read the blob back 1055msapps/diffinery test: ✓ test/unit/push-retry.test.ts (4 tests) 25msapps/diffinery test: ✓ test/unit/org-variables.test.ts (2 tests) 16msapps/diffinery test: ✓ test/unit/wait-timer.test.ts (5 tests) 19msapps/diffinery test: ✓ test/unit/stages.test.ts (3 tests) 25msapps/diffinery test: ✓ test/unit/d1.test.ts (3 tests) 13msapps/diffinery test: ✓ test/unit/environment-secrets.test.ts (4 tests) 11msapps/diffinery test: ✓ test/unit/upload-pack.test.ts (1 test) 3969msapps/diffinery test: ✓ sends each object as it is read, in side-band packets, never the whole pack at once 3955msapps/diffinery test: ✓ test/unit/receive-head.test.ts (2 tests) 39msapps/diffinery test: ✓ test/unit/job-secrets.test.ts (4 tests) 30msapps/diffinery test: ✓ test/unit/tree-names.test.ts (5 tests) 15msapps/diffinery test: (node:2878) ExperimentalWarning: SQLite is an experimental feature and might change at any timeapps/diffinery test: (Use `node --trace-warnings ...` to show where the warning was created)apps/diffinery test: ✓ test/unit/inflight.test.ts (1 test) 91msapps/diffinery test: ✓ test/unit/archive-stream.test.ts (3 tests) 968msapps/diffinery test: ✓ refuse more entries than classic zip can hold instead of writing a broken archive 667msapps/diffinery test: ✓ test/unit/unpack-failure.test.ts (2 tests) 13msapps/diffinery test: ✓ test/unit/terminal-command.test.ts (1 test) 13msapps/diffinery test: ✓ test/unit/graphql.test.ts (3 tests) 46msapps/diffinery test: Test Files 40 passed (40)apps/diffinery test: Tests 308 passed (308)apps/diffinery test: Start at 17:45:40apps/diffinery test: Duration 31.08s (transform 22.87s, setup 0ms, import 38.67s, tests 30.11s, environment 18ms)apps/diffinery test: Donecontainers/runner test: ❯ test/docker-wrapper.test.ts (4 tests | 1 failed) 27512mscontainers/runner test: ✓ lets docker commands that arrive while the daemon is starting through, with the head start on 1697mscontainers/runner test: ✓ gives up with a message, not a hang, when the daemon never comes up 2822mscontainers/runner test: ✓ starts the registry relay and the daemon together 2881mscontainers/runner test: × starts the daemon again without the relay when the relay never comes up 20099mscontainers/runner test: ✓ test/docker.test.ts (4 tests) 36442mscontainers/runner test: ✓ runs steps and JavaScript actions in a job container next to a service container 19766mscontainers/runner test: ✓ runs docker:// steps and Dockerfile actions with inputs, outputs, args and post entrypoints 9947mscontainers/runner test: ✓ fails a service that never gets healthy, and cleans up 6086mscontainers/runner test: ✓ explains that containers need Docker 638mscontainers/runner test: ⎯⎯⎯⎯⎯⎯⎯ Failed Tests 1 ⎯⎯⎯⎯⎯⎯⎯containers/runner test: FAIL test/docker-wrapper.test.ts > docker wrapper > starts the daemon again without the relay when the relay never comes upcontainers/runner test: AssertionError: Starting the Docker daemoncontainers/runner test: The registry relay did not start, so image layers over 100 MB can't be pushed to diffinery.test:containers/runner test: : expected null to be +0 // Object.is equalitycontainers/runner test: - Expected:containers/runner test: 0containers/runner test: + Received:containers/runner test: nullcontainers/runner test: ❯ test/docker-wrapper.test.ts:142:32containers/runner test: 140| const env = { ...process.env, PATH: `${bin}:${process.env.PATH}`, …containers/runner test: 141| const r = spawnSync("bash", ["-c", "docker version"], { env, encod…containers/runner test: 142| expect(r.status, r.stderr).toBe(0);containers/runner test: | ^containers/runner test: 143| expect(r.stdout).toContain("docker version");containers/runner test: 144| expect(r.stderr).toContain("The registry relay did not start");containers/runner test: ⎯⎯⎯⎯⎯⎯⎯⎯⎯⎯⎯⎯⎯⎯⎯⎯⎯⎯⎯⎯⎯⎯⎯⎯[1/1]⎯containers/runner test: Test Files 1 failed | 5 passed (6)containers/runner test: Tests 1 failed | 42 passed (43)containers/runner test: Start at 17:45:40containers/runner test: Duration 52.48s (transform 3.29s, setup 0ms, import 13.02s, tests 81.68s, environment 1ms)containers/runner test: ::error file=/workspace/diffinery/containers/runner/test/docker-wrapper.test.ts,title=test/docker-wrapper.test.ts > docker wrapper > starts the daemon again without the relay when the relay never comes up,line=142,column=32::AssertionError: Starting the Docker daemon%0AThe registry relay did not start, so image layers over 100 MB can't be pushed to diffinery.test:%0A: expected null to be +0 // Object.is equality%0A%0A- Expected:%0A0%0A%0A+ Received:%0Anull%0A%0A ❯ test/docker-wrapper.test.ts:142:32%0A%0Acontainers/runner test: Failed/workspace/diffinery/containers/runner: ERR_PNPM_RECURSIVE_RUN_FIRST_FAIL @diffinery/runner@0.1.0 test: `vitest run --shard=1/2`Exit status 1##[error]Process completed with exit code 1.
Post Run pnpm/action-setup@b906affcce14559ad1aafd4ab0e942779e9f58b10s
Pruning is unnecessary.Post Run actions/checkout@v40s
Removing persisted credentialsJob summary
Vitest Test Report
Summary
- Test Files: ✅ 1 pass · 1 total
- Test Results: ✅ 6 passes · 6 total
Vitest Test Report
Summary
- Test Files: ✅ 3 passes · 3 total
- Test Results: ✅ 102 passes · 102 total
Vitest Test Report
Summary
- Test Files: ✅ 3 passes · 3 total
- Test Results: ✅ 14 passes · 14 total
Vitest Test Report
Summary
- Test Files: ✅ 4 passes · 4 total
- Test Results: ✅ 44 passes · 44 total
Vitest Test Report
Summary
- Test Files: ✅ 40 passes · 40 total
- Test Results: ✅ 308 passes · 308 total
Vitest Test Report
Summary
- Test Files: ❌ 1 failure · ✅ 5 passes · 6 total
- Test Results: ❌ 1 failure · ✅ 42 passes · 43 total