Diffinery

codician/diffinerypublic

Open-source, agent-first GitHub and GitHub Actions alternative that runs on your own Cloudflare account: git hosting, pull requests, code review and drop-in GitHub Actions YAML on Workers, Durable Objects, R2 and Containers.

End-to-end (runner Docker)

took 1m 34s Raw logs
Failed at Runner Docker tests (job containers, services, Docker actions)
/workspace/diffinery/containers/runner/test/docker-wrapper.test.ts:156: test/docker-wrapper.test.ts > docker wrapper > starts the daemon again without the relay when the relay never comes up: AssertionError: expected 'http://127.0.0.1:35511\n' to be 'http://127.0.0.1:35511\nnone\n' // Object.is equality

- Expected
+ Received

- http://127.0.0.1:35511
- none
+ http://127.0.0.1:35511


 ❯ test/docker-wrapper.test.ts:156:67

Set up job
Diffinery runner: job runner-docker (End-to-end (runner Docker)) for codician/diffinery@abece69c5d71Runner: image diffinery-runner:bca05d12d6c57337029615de, in lhr19, WEUR, container 00dbee14f67633f850bf65650a2ef9219ca8a1c19f7061396ea48d72de2d6aa8Runner size: large (4 vCPU, 12 GiB of memory, 20 GB of disk), this job uses what a smaller runner doesn't have; runs-on: diffinery-large (or -medium, -small, -tiny) sets a sizeHost: AMD EPYC (family 25, model 17), 4 vCPUs, 2550 MHzWorkspace: /workspace/diffineryHost: 10% of the vCPUs' time went to other work on the host (steal)Job completed with conclusion: failureResources: 0.6 of 4 vCPUs busy on average (1.5 at the 95th percentile), peak memory 1.2 GiB of 11.9 GiB, peak disk 2.3 GB of 19.2 GB
Run actions/checkout@v44s
##[group]Run actions/checkout@v4##[endgroup]Syncing repository: codician/diffineryFetching the repository (depth 1)remote: Enumerating objects: 918, done.        Receiving objects:   0% (1/918)
Receiving objects:   1% (10/918)
Receiving objects:   2% (19/918)
Receiving objects:   3% (28/918)
Receiving objects:   4% (37/918)
Receiving objects:   5% (46/918)
Receiving objects:   6% (56/918)
Receiving objects:   7% (65/918)
Receiving objects:   8% (74/918)
Receiving objects:   9% (83/918)
Receiving objects:  10% (92/918)
Receiving objects:  11% (101/918)
Receiving objects:  12% (111/918)
Receiving objects:  13% (120/918)
Receiving objects:  14% (129/918)
Receiving objects:  15% (138/918)
Receiving objects:  16% (147/918)
Receiving objects:  17% (157/918)
Receiving objects:  18% (166/918)
Receiving objects:  19% (175/918)
Receiving objects:  20% (184/918)
Receiving objects:  21% (193/918)
Receiving objects:  22% (202/918)
Receiving objects:  23% (212/918)
Receiving objects:  24% (221/918)
Receiving objects:  25% (230/918)
Receiving objects:  26% (239/918)
Receiving objects:  27% (248/918)
Receiving objects:  28% (258/918)
Receiving objects:  29% (267/918)
Receiving objects:  30% (276/918)
Receiving objects:  31% (285/918)
Receiving objects:  32% (294/918)
Receiving objects:  33% (303/918)
Receiving objects:  34% (313/918)
Receiving objects:  35% (322/918)
Receiving objects:  36% (331/918)
Receiving objects:  37% (340/918)
Receiving objects:  38% (349/918)
Receiving objects:  39% (359/918)
Receiving objects:  40% (368/918)
Receiving objects:  41% (377/918)
Receiving objects:  42% (386/918)
Receiving objects:  43% (395/918)
Receiving objects:  44% (404/918)
Receiving objects:  45% (414/918)
Receiving objects:  46% (423/918)
Receiving objects:  47% (432/918)
Receiving objects:  48% (441/918)
Receiving objects:  49% (450/918)
Receiving objects:  50% (459/918)
Receiving objects:  51% (469/918)
Receiving objects:  52% (478/918)
Receiving objects:  53% (487/918)
Receiving objects:  54% (496/918)
Receiving objects:  55% (505/918)
Receiving objects:  56% (515/918)
Receiving objects:  57% (524/918)
Receiving objects:  58% (533/918)
Receiving objects:  59% (542/918)
Receiving objects:  60% (551/918)
Receiving objects:  61% (560/918)
Receiving objects:  62% (570/918)
Receiving objects:  63% (579/918)
Receiving objects:  64% (588/918)
Receiving objects:  65% (597/918)
Receiving objects:  66% (606/918)
Receiving objects:  67% (616/918)
Receiving objects:  68% (625/918)
Receiving objects:  69% (634/918)
Receiving objects:  70% (643/918)
Receiving objects:  71% (652/918)
Receiving objects:  72% (661/918)
Receiving objects:  73% (671/918)
Receiving objects:  74% (680/918)
Receiving objects:  75% (689/918)
Receiving objects:  76% (698/918)
Receiving objects:  77% (707/918)
Receiving objects:  78% (717/918)
Receiving objects:  79% (726/918)
Receiving objects:  80% (735/918)
Receiving objects:  81% (744/918)
Receiving objects:  82% (753/918)
Receiving objects:  83% (762/918)
Receiving objects:  84% (772/918)
Receiving objects:  85% (781/918)
Receiving objects:  86% (790/918)
Receiving objects:  87% (799/918)
Receiving objects:  88% (808/918)
Receiving objects:  89% (818/918)
Receiving objects:  90% (827/918)
Receiving objects:  91% (836/918)
Receiving objects:  92% (845/918)
Receiving objects:  93% (854/918)
Receiving objects:  94% (863/918)
Receiving objects:  95% (873/918)
Receiving objects:  96% (882/918)
remote: Total 918 (delta 0), reused 918 (delta 0)        Receiving objects:  97% (891/918)
Receiving objects:  98% (900/918)
Receiving objects:  99% (909/918)
Receiving objects: 100% (918/918)
Receiving objects: 100% (918/918), 5.82 MiB | 13.30 MiB/s, done.From https://diffinery.com/codician/diffinery * [new ref]         abece69c5d71dab9d3e67748aad2ce806116582a -> origin/diffinery-checkoutNote: switching to 'abece69c5d71dab9d3e67748aad2ce806116582a'.You are in 'detached HEAD' state. You can look around, make experimentalchanges and commit them, and you can discard any commits you make in thisstate without impacting any branches by switching back to a branch.If you want to create a new branch to retain commits you create, you maydo so (now or later) by using -c with the switch command. Example:  git switch -c <new-branch-name>Or undo this operation with:  git switch -Turn off this advice by setting config variable advice.detachedHead to falseHEAD is now at abece69 Merge 0b3a209ba9de785299bbbdce2cfa5a73762f58e5 into 2bf0f4555718ede811c403e389ee66f876e290bbHEAD is now at abece69c5d71dab9d3e67748aad2ce806116582a
Run pnpm/action-setup@b906affcce14559ad1aafd4ab0e942779e9f58b13s
Download action repository 'pnpm/action-setup@b906affcce14559ad1aafd4ab0e942779e9f58b1'##[group]Run pnpm/action-setup@b906affcce14559ad1aafd4ab0e942779e9f58b1with:  dest: ~/setup-pnpm  run_install: null  cache: false  cache_dependency_path: pnpm-lock.yaml  package_json_file: package.json  standalone: false##[endgroup]##[group]Running self-installer...Progress: resolved 1, reused 0, downloaded 0, added 0Packages: +1+Progress: resolved 1, reused 0, downloaded 1, added 1, donedependencies:+ pnpm 10.28.0 (12.15.0 is available)Done in 1.8s##[endgroup]Installation Completed!
Run actions/setup-node@v412s
##[group]Run actions/setup-node@v4with:  node-version: 22  cache: pnpm##[endgroup]Found in cache @ 22.22.0 (pre-installed node satisfies '22')Cache Size: ~216 MB (226934503 B)Cache restored from key: node-cache-Linux-x64-pnpm-42d02c0263a3b5f911ed6ae8e9210922b97166ca02e60b2c70c55dfa1f00371b
Run pnpm install --frozen-lockfile7s
##[group]Run pnpm install --frozen-lockfile##[endgroup]Scope: all 8 workspace projectsLockfile is up to date, resolution step is skippedProgress: resolved 1, reused 0, downloaded 0, added 0Packages: +251++++++++++++++++++++++++++++++++++++++++++++++++++++++++++++++++++++++++++++++++Progress: resolved 251, reused 245, downloaded 0, added 26Progress: resolved 251, reused 245, downloaded 0, added 165Progress: resolved 251, reused 245, downloaded 0, added 251, done.../esbuild@0.28.1/node_modules/esbuild postinstall$ node install.js.../node_modules/workerd postinstall$ node install.js.../esbuild@0.25.11/node_modules/esbuild postinstall$ node install.js.../esbuild@0.25.12/node_modules/esbuild postinstall$ node install.js.../node_modules/workerd postinstall$ node install.js.../esbuild@0.25.11/node_modules/esbuild postinstall: Done.../esbuild@0.28.2/node_modules/esbuild postinstall$ node install.js.../esbuild@0.25.12/node_modules/esbuild postinstall: Done.../node_modules/workerd postinstall: Done.../esbuild@0.28.1/node_modules/esbuild postinstall: Done.../esbuild@0.28.2/node_modules/esbuild postinstall: Done.../node_modules/workerd postinstall: DonedevDependencies:+ turbo 2.11.7+ typescript 5.9.3Done in 6.5s using pnpm v10.28.0
Run pnpm --filter @diffinery/runner build1s
##[group]Run pnpm --filter @diffinery/runner build##[endgroup]> @diffinery/runner@0.1.0 build /workspace/diffinery/containers/runner> esbuild src/main.ts --bundle --platform=node --target=node22 --format=esm --outfile=dist/agent.mjs --external:bufferutil --external:utf-8-validate "--banner:js=import { createRequire as __diffineryCreateRequire } from 'node:module'; const require = __diffineryCreateRequire(import.meta.url);"  dist/agent.mjs  684.1kb⚡ Done in 78ms
Use this change's Docker wrapper, daemon config and agent31s
##[group]Run set -euo pipefailas_root() { if [ "$(id -u)" = 0 ]; then "$@"; else sudo "$@"; fi; }if [ ! -f /opt/diffinery/agent.mjs ] || ! grep -q "registry relay" /usr/local/bin/docker 2>/dev/null; then  echo "::error::this job needs a Diffinery hosted runner (its docker wrapper and agent)"  exit 1fias_root pkill -x dockerd || trueas_root pkill -f -- "--registry-relay" || truefor _ in $(seq 1 60); do pgrep -x dockerd >/dev/null || break; sleep 0.5; doneas_root rm -f /run/diffinery-dockerd.readyas_root cp --remove-destination containers/runner/image/docker /usr/local/bin/dockeras_root cp --remove-destination containers/runner/image/daemon.json /etc/docker/daemon.jsonas_root cp --remove-destination containers/runner/dist/agent.mjs /opt/diffinery/agent.mjs##[endgroup]
Docker's first uses, several at once5s
##[group]Run set -uo pipefailstart=$(date +%s)docker info >/dev/null & a=$!docker ps >/dev/null & b=$!docker version >/dev/null & c=$!failed=0for p in $a $b $c; do wait "$p" || failed=1; doneecho "three docker commands at once, the daemon starting: $(( $(date +%s) - start )) s"[ "$failed" = 0 ] || { echo "::error::a docker command failed while the daemon started"; exit 1; }docker run --rm mirror.gcr.io/library/alpine:3.20 echo "container ok"##[endgroup]Starting the Docker daemonWARNING: No swap limit supportthree docker commands at once, the daemon starting: 3 sUnable to find image 'mirror.gcr.io/library/alpine:3.20' locally3.20: Pulling from library/alpine25f1d6b1951a: Pulling fs layer25f1d6b1951a: Download complete3a030ca3f633: Download completed4050d56ebf2: Download complete25f1d6b1951a: Pull completeDigest: sha256:d9e853e87e55526f6b2917df91a2115c36dd7c696a35be12163d44e6e2a4b6bcStatus: Downloaded newer image for mirror.gcr.io/library/alpine:3.20container ok
Runner Docker tests (job containers, services, Docker actions)30s
##[group]Run pnpm exec vitest run test/docker.test.ts test/docker-wrapper.test.ts##[endgroup](!) Your Vite config uses features that are unsupported by `configLoader: 'native'`, which is planned to become the default in a future major version of Vite:  - import "../../vitest.shared" without a file extension (vitest.config.ts:2:26). Add the file extension  - ESM syntax in a file loaded as CommonJS (../../vitest.shared.ts:10:1). Use a `.mjs` extension or set `"type": "module"` in the closest package.jsonSet `VITE_CONFIG_NATIVE_IGNORE_WARNING=true` to suppress this warning. RUN  v4.1.11 /workspace/diffinery/containers/runner ❯ test/docker-wrapper.test.ts (4 tests | 1 failed) 7584ms     ✓ lets docker commands that arrive while the daemon is starting through, with the head start on  1294ms     ✓ gives up with a message, not a hang, when the daemon never comes up  2429ms     ✓ starts the registry relay and the daemon together  2224ms     × starts the daemon again without the relay when the relay never comes up 1634ms ✓ test/docker.test.ts (4 tests) 26500ms     ✓ runs steps and JavaScript actions in a job container next to a service container  11951ms     ✓ runs docker:// steps and Dockerfile actions with inputs, outputs, args and post entrypoints  8033ms     ✓ fails a service that never gets healthy, and cleans up  5690ms     ✓ explains that containers need Docker  819ms⎯⎯⎯⎯⎯⎯⎯ Failed Tests 1 ⎯⎯⎯⎯⎯⎯⎯ FAIL  test/docker-wrapper.test.ts > docker wrapper > starts the daemon again without the relay when the relay never comes upAssertionError: expected 'http://127.0.0.1:35511\n' to be 'http://127.0.0.1:35511\nnone\n' // Object.is equality- Expected+ Received- http://127.0.0.1:35511- none+ http://127.0.0.1:35511 ❯ test/docker-wrapper.test.ts:156:67    154|     expect(r.stdout).toContain("docker version");    155|     expect(r.stderr).toContain("The registry relay did not start");    156|     expect(readFileSync(path.join(dir, "dockerd.proxy"), "utf8")).toBe…       |                                                                   ^    157|     const [first, second] = readFileSync(path.join(dir, "dockerd.pids"…    158|     // Gone (or a zombie: nothing may reap it in a container), while t…⎯⎯⎯⎯⎯⎯⎯⎯⎯⎯⎯⎯⎯⎯⎯⎯⎯⎯⎯⎯⎯⎯⎯⎯[1/1]⎯ Test Files  1 failed | 1 passed (2)      Tests  1 failed | 7 passed (8)   Start at  13:32:19   Duration  28.13s (transform 1.74s, setup 0ms, import 2.47s, tests 34.08s, environment 0ms)##[error]/workspace/diffinery/containers/runner/test/docker-wrapper.test.ts:156: test/docker-wrapper.test.ts > docker wrapper > starts the daemon again without the relay when the relay never comes up: AssertionError: expected 'http://127.0.0.1:35511\n' to be 'http://127.0.0.1:35511\nnone\n' // Object.is equality- Expected+ Received- http://127.0.0.1:35511- none+ http://127.0.0.1:35511 ❯ test/docker-wrapper.test.ts:156:67##[error]Process completed with exit code 1.
Post Run pnpm/action-setup@b906affcce14559ad1aafd4ab0e942779e9f58b10s
Pruning is unnecessary.
Post Run actions/checkout@v40s
Removing persisted credentials

Job summary

Vitest Test Report

Summary

  • Test Files: ❌ 1 failure · ✅ 1 pass · 2 total
  • Test Results: ❌ 1 failure · ✅ 7 passes · 8 total