Diffinery

codician/diffinerypublic

Open-source, agent-first GitHub and GitHub Actions alternative that runs on your own Cloudflare account: git hosting, pull requests, code review and drop-in GitHub Actions YAML on Workers, Durable Objects, R2 and Containers.

Unit tests (1/2)

took 1m 22s Raw logs

Matrix: shard: 1

Failed at Unit tests
Process completed with exit code 1.

apps/diffinery test:  FAIL  test/unit/markdown-safety.test.ts > markdown block patterns > bounds the lookahead for emphasis openers that never close
apps/diffinery test: AssertionError: expected 687.8271760000007 to be less than 500
apps/diffinery test:  ❯ test/unit/markdown-safety.test.ts:36:30
apps/diffinery test:      35|   });
apps/diffinery test:      36|
apps/diffinery test:      37|   it("formats ordinary text in full", () => {
apps/diffinery test:        |                             ^
apps/diffinery test:      38|     const text = Array.from({ length: 2000 }, (_, i) => `Item ${i} has…
apps/diffinery test:      39|     const html = renderMarkdown(text);
apps/diffinery test: ⎯⎯⎯⎯⎯⎯⎯⎯⎯⎯⎯⎯⎯⎯⎯⎯⎯⎯⎯⎯⎯⎯⎯⎯[1/1]⎯
apps/diffinery test:  Test Files  1 failed | 37 passed (38)
apps/diffinery test:       Tests  1 failed | 289 passed (290)
apps/diffinery test:    Start at  14:33:44
apps/diffinery test:    Duration  21.99s (transform 16.42s, setup 0ms, import 24.30s, tests 22.05s, environment 18ms)
apps/diffinery test: ::error file=/workspace/diffinery/apps/diffinery/test/unit/markdown-safety.test.ts,title=test/unit/markdown-safety.test.ts > markdown block patterns > bounds the lookahead for emphasis openers that never close,line=36,column=30::AssertionError: expected 687.8271760000007 to be less than 500%0A ❯ test/unit/markdown-safety.test.ts:36:30%0A%0A
apps/diffinery test: Failed
/workspace/diffinery/apps/diffinery:
 ERR_PNPM_RECURSIVE_RUN_FIRST_FAIL  @diffinery/app@0.1.0 test: `vitest run --passWithNoTests --exclude 'test/e2e/**' --shard=1/2`
Exit status 1
Set up job
Diffinery runner: job test (Unit tests (1/2)) for codician/diffinery@172403adee65Runner: image diffinery-runner:0d9b89e0a449e5faecf2b19c, in ams15, WEUR, container 96cc7d1618b45b67f12c54c791479947e500c5d5cf6676aab3122bf4e3d887edRunner size: large (4 vCPU, 12 GiB of memory, 20 GB of disk), this job uses what a smaller runner doesn't have; runs-on: diffinery-large (or -medium, -small, -tiny) sets a sizeHost: AMD EPYC (family 25, model 1), 4 vCPUs, 2000 MHzWorkspace: /workspace/diffineryHost: 1% of the vCPUs' time went to other work on the host (steal)Job completed with conclusion: failureResources: 2.0 of 4 vCPUs busy on average (3.9 at the 95th percentile), peak memory 2.2 GiB of 11.9 GiB, peak disk 2.2 GB of 19.3 GB
Run actions/checkout@v42s
##[group]Run actions/checkout@v4##[endgroup]Syncing repository: codician/diffineryFetching the repository (depth 1)remote: Enumerating objects: 625, done.        Receiving objects:   0% (1/625)
Receiving objects:   1% (7/625)
Receiving objects:   2% (13/625)
Receiving objects:   3% (19/625)
Receiving objects:   4% (25/625)
Receiving objects:   5% (32/625)
Receiving objects:   6% (38/625)
Receiving objects:   7% (44/625)
Receiving objects:   8% (50/625)
Receiving objects:   9% (57/625)
Receiving objects:  10% (63/625)
Receiving objects:  11% (69/625)
Receiving objects:  12% (75/625)
Receiving objects:  13% (82/625)
Receiving objects:  14% (88/625)
Receiving objects:  15% (94/625)
Receiving objects:  16% (100/625)
Receiving objects:  17% (107/625)
Receiving objects:  18% (113/625)
Receiving objects:  19% (119/625)
Receiving objects:  20% (125/625)
Receiving objects:  21% (132/625)
Receiving objects:  22% (138/625)
Receiving objects:  23% (144/625)
Receiving objects:  24% (150/625)
Receiving objects:  25% (157/625)
Receiving objects:  26% (163/625)
Receiving objects:  27% (169/625)
Receiving objects:  28% (175/625)
Receiving objects:  29% (182/625)
Receiving objects:  30% (188/625)
Receiving objects:  31% (194/625)
Receiving objects:  32% (200/625)
Receiving objects:  33% (207/625)
Receiving objects:  34% (213/625)
Receiving objects:  35% (219/625)
Receiving objects:  36% (225/625)
Receiving objects:  37% (232/625)
Receiving objects:  38% (238/625)
Receiving objects:  39% (244/625)
Receiving objects:  40% (250/625)
Receiving objects:  41% (257/625)
Receiving objects:  42% (263/625)
Receiving objects:  43% (269/625)
Receiving objects:  44% (275/625)
Receiving objects:  45% (282/625)
Receiving objects:  46% (288/625)
Receiving objects:  47% (294/625)
Receiving objects:  48% (300/625)
Receiving objects:  49% (307/625)
Receiving objects:  50% (313/625)
Receiving objects:  51% (319/625)
Receiving objects:  52% (325/625)
Receiving objects:  53% (332/625)
Receiving objects:  54% (338/625)
Receiving objects:  55% (344/625)
Receiving objects:  56% (350/625)
Receiving objects:  57% (357/625)
Receiving objects:  58% (363/625)
Receiving objects:  59% (369/625)
Receiving objects:  60% (375/625)
Receiving objects:  61% (382/625)
Receiving objects:  62% (388/625)
Receiving objects:  63% (394/625)
Receiving objects:  64% (400/625)
Receiving objects:  65% (407/625)
Receiving objects:  66% (413/625)
Receiving objects:  67% (419/625)
Receiving objects:  68% (425/625)
Receiving objects:  69% (432/625)
Receiving objects:  70% (438/625)
Receiving objects:  71% (444/625)
Receiving objects:  72% (450/625)
Receiving objects:  73% (457/625)
Receiving objects:  74% (463/625)
Receiving objects:  75% (469/625)
Receiving objects:  76% (475/625)
Receiving objects:  77% (482/625)
Receiving objects:  78% (488/625)
Receiving objects:  79% (494/625)
Receiving objects:  80% (500/625)
Receiving objects:  81% (507/625)
Receiving objects:  82% (513/625)
Receiving objects:  83% (519/625)
Receiving objects:  84% (525/625)
Receiving objects:  85% (532/625)
Receiving objects:  86% (538/625)
Receiving objects:  87% (544/625)
Receiving objects:  88% (550/625)
Receiving objects:  89% (557/625)
Receiving objects:  90% (563/625)
Receiving objects:  91% (569/625)
Receiving objects:  92% (575/625)
Receiving objects:  93% (582/625)
Receiving objects:  94% (588/625)
Receiving objects:  95% (594/625)
Receiving objects:  96% (600/625)
remote: Total 625 (delta 0), reused 625 (delta 0)        Receiving objects:  97% (607/625)
Receiving objects:  98% (613/625)
Receiving objects:  99% (619/625)
Receiving objects: 100% (625/625)
Receiving objects: 100% (625/625), 2.55 MiB | 6.76 MiB/s, done.From https://diffinery.com/codician/diffinery * [new ref]         172403adee653d4a1819f7d1d3913ae15bc26616 -> origin/diffinery-checkoutNote: switching to '172403adee653d4a1819f7d1d3913ae15bc26616'.You are in 'detached HEAD' state. You can look around, make experimentalchanges and commit them, and you can discard any commits you make in thisstate without impacting any branches by switching back to a branch.If you want to create a new branch to retain commits you create, you maydo so (now or later) by using -c with the switch command. Example:  git switch -c <new-branch-name>Or undo this operation with:  git switch -Turn off this advice by setting config variable advice.detachedHead to falseHEAD is now at 172403a Merge 1b1fe31a1aad26c56517ebcc3103b3a9f338444a into 166eba04023f72985ad8b85f14a9fc9195d25bc7HEAD is now at 172403adee653d4a1819f7d1d3913ae15bc26616
Run pnpm/action-setup@b906affcce14559ad1aafd4ab0e942779e9f58b14s
Download action repository 'pnpm/action-setup@b906affcce14559ad1aafd4ab0e942779e9f58b1'##[group]Run pnpm/action-setup@b906affcce14559ad1aafd4ab0e942779e9f58b1with:  dest: ~/setup-pnpm  run_install: null  cache: false  cache_dependency_path: pnpm-lock.yaml  package_json_file: package.json  standalone: false##[endgroup]##[group]Running self-installer...Progress: resolved 1, reused 0, downloaded 0, added 0Packages: +1+Progress: resolved 1, reused 0, downloaded 1, added 0Progress: resolved 1, reused 0, downloaded 1, added 1, donedependencies:+ pnpm 10.28.0 (12.14.0 is available)Done in 2s##[endgroup]Installation Completed!
Run actions/setup-node@v411s
##[group]Run actions/setup-node@v4with:  node-version: 22  cache: pnpm##[endgroup]Found in cache @ 22.22.0 (pre-installed node satisfies '22')Cache Size: ~216 MB (226515969 B)Cache restored from key: node-cache-Linux-x64-pnpm-aa519d0d5d7e5a224fb440987e5331e1cb7b3a95e67805db372d6def9572f2b0
Run pnpm install --frozen-lockfile19s
##[group]Run pnpm install --frozen-lockfile##[endgroup]Scope: all 7 workspace projectsLockfile is up to date, resolution step is skippedProgress: resolved 1, reused 0, downloaded 0, added 0Packages: +249++++++++++++++++++++++++++++++++++++++++++++++++++++++++++++++++++++++++++++++++Progress: resolved 249, reused 243, downloaded 0, added 158Progress: resolved 249, reused 243, downloaded 0, added 249, donedevDependencies:+ turbo 2.11.7+ typescript 5.9.3Done in 18.3s using pnpm v10.28.0
Build3s
##[group]Run pnpm -r --if-present build##[endgroup]Scope: 6 of 7 workspace projectsapps/cli build$ esbuild src/bin.ts --bundle --platform=node --target=node22 --format=esm --outfile=dist/diffinery.mjs "--banner:js=#!/usr/bin/env nodeimport { createRequire as __diffineryCreateRequire } from 'node:module'; const require = __diffineryCreateRequire(import.meta.url);"apps/diffinery build$ node islands/build.mjs && node scripts/build-docs.mjscontainers/runner build$ esbuild src/main.ts --bundle --platform=node --target=node22 --format=esm --outfile=dist/agent.mjs --external:bufferutil --external:utf-8-validate "--banner:js=import { createRequire as __diffineryCreateRequire } from 'node:module'; const require = __diffineryCreateRequire(import.meta.url);"apps/cli build:   dist/diffinery.mjs  444.7kbapps/cli build: ⚡ Done in 88msapps/cli build: Donecontainers/runner build:   dist/agent.mjs  666.9kbcontainers/runner build: ⚡ Done in 114mscontainers/runner build: Doneapps/diffinery build: islands: kumo.js 466 KB, kumo.css 149 KB, terminal.js 286 KBapps/diffinery build: docs: 65 pages (+2 generated at runtime), CLI 0.1.0 (234 KiB)apps/diffinery build: Done
Unit tests42s
##[group]Run pnpm -r --if-present run test --shard=1/2##[endgroup]Scope: 6 of 7 workspace projectspackages/git-core test$ vitest run --shard=1/2packages/workflow-yaml test$ vitest run --shard=1/2packages/workflow-yaml test: (!) Your Vite config uses features that are unsupported by `configLoader: 'native'`, which is planned to become the default in a future major version of Vite:packages/workflow-yaml test:   - import "../../vitest.shared" without a file extension (vitest.config.ts:2:26). Add the file extensionpackages/workflow-yaml test:   - ESM syntax in a file loaded as CommonJS (../../vitest.shared.ts:10:1). Use a `.mjs` extension or set `"type": "module"` in the closest package.jsonpackages/workflow-yaml test: Set `VITE_CONFIG_NATIVE_IGNORE_WARNING=true` to suppress this warning.packages/workflow-yaml test:  RUN  v4.1.11 /workspace/diffinery/packages/workflow-yamlpackages/git-core test: (!) Your Vite config uses features that are unsupported by `configLoader: 'native'`, which is planned to become the default in a future major version of Vite:packages/git-core test:   - import "../../vitest.shared" without a file extension (vitest.config.ts:2:26). Add the file extensionpackages/git-core test:   - ESM syntax in a file loaded as CommonJS (../../vitest.shared.ts:10:1). Use a `.mjs` extension or set `"type": "module"` in the closest package.jsonpackages/git-core test: Set `VITE_CONFIG_NATIVE_IGNORE_WARNING=true` to suppress this warning.packages/git-core test:  RUN  v4.1.11 /workspace/diffinery/packages/git-corepackages/workflow-yaml test:  ✓ test/cron.test.ts (23 tests) 64mspackages/workflow-yaml test:  ✓ test/expr.test.ts (48 tests) 76mspackages/workflow-yaml test:  ✓ test/parse.test.ts (31 tests) 152mspackages/workflow-yaml test:  Test Files  3 passed (3)packages/workflow-yaml test:       Tests  102 passed (102)packages/workflow-yaml test:    Start at  14:33:26packages/workflow-yaml test:    Duration  1.09s (transform 945ms, setup 0ms, import 1.81s, tests 291ms, environment 5ms)packages/workflow-yaml test: Donepackages/git-core test:  ✓ test/pack-stream.test.ts (3 tests) 277mspackages/git-core test:  ✓ test/diff-budget.test.ts (5 tests) 1341mspackages/git-core test:      ✓ a file rewritten from scratch is diffed in one pass, as one replaced block  393mspackages/git-core test:      ✓ a three-way merge too large to compute is a conflict, quickly  928mspackages/git-core test:  ✓ test/pack-limits.test.ts (6 tests) 15827mspackages/git-core test:      ✓ resolves a long delta chain in one pass, whatever order the pack lists it in  9905mspackages/git-core test:      ✓ counts what each object costs in memory, not only its content  3242mspackages/git-core test:      ✓ refuses a small pack whose objects inflate past the memory budget  2576mspackages/git-core test:  Test Files  3 passed (3)packages/git-core test:       Tests  14 passed (14)packages/git-core test:    Start at  14:33:26packages/git-core test:    Duration  16.87s (transform 1.05s, setup 0ms, import 1.67s, tests 17.45s, environment 1ms)packages/git-core test: Doneapps/cli test$ vitest run --shard=1/2containers/runner test$ vitest run --shard=1/2apps/diffinery test$ vitest run --passWithNoTests --exclude 'test/e2e/**' --shard=1/2containers/runner test: (!) Your Vite config uses features that are unsupported by `configLoader: 'native'`, which is planned to become the default in a future major version of Vite:containers/runner test:   - import "../../vitest.shared" without a file extension (vitest.config.ts:2:26). Add the file extensioncontainers/runner test:   - ESM syntax in a file loaded as CommonJS (../../vitest.shared.ts:10:1). Use a `.mjs` extension or set `"type": "module"` in the closest package.jsoncontainers/runner test: Set `VITE_CONFIG_NATIVE_IGNORE_WARNING=true` to suppress this warning.apps/cli test: (!) Your Vite config uses features that are unsupported by `configLoader: 'native'`, which is planned to become the default in a future major version of Vite:apps/cli test:   - import "../../vitest.shared" without a file extension (vitest.config.ts:2:26). Add the file extensionapps/cli test:   - ESM syntax in a file loaded as CommonJS (../../vitest.shared.ts:10:1). Use a `.mjs` extension or set `"type": "module"` in the closest package.jsonapps/cli test: Set `VITE_CONFIG_NATIVE_IGNORE_WARNING=true` to suppress this warning.containers/runner test:  RUN  v4.1.11 /workspace/diffinery/containers/runnerapps/diffinery test: (!) Your Vite config uses features that are unsupported by `configLoader: 'native'`, which is planned to become the default in a future major version of Vite:apps/diffinery test:   - import "../../vitest.shared" without a file extension (vitest.config.ts:3:26). Add the file extensionapps/diffinery test:   - ESM syntax in a file loaded as CommonJS (../../vitest.shared.ts:10:1). Use a `.mjs` extension or set `"type": "module"` in the closest package.jsonapps/diffinery test: Set `VITE_CONFIG_NATIVE_IGNORE_WARNING=true` to suppress this warning.apps/cli test:  RUN  v4.1.11 /workspace/diffinery/apps/cliapps/diffinery test:  RUN  v4.1.11 /workspace/diffinery/apps/diffineryapps/diffinery test: (node:429) ExperimentalWarning: SQLite is an experimental feature and might change at any timeapps/diffinery test: (Use `node --trace-warnings ...` to show where the warning was created)containers/runner test:  ✓ test/jail.test.ts (12 tests) 319msapps/diffinery test:  ✓ test/unit/usage.test.ts (23 tests) 187msapps/cli test:  ✓ test/login.test.ts (12 tests) 889msapps/diffinery test: (node:430) ExperimentalWarning: SQLite is an experimental feature and might change at any timeapps/diffinery test: (Use `node --trace-warnings ...` to show where the warning was created)apps/diffinery test: (node:468) ExperimentalWarning: SQLite is an experimental feature and might change at any timeapps/diffinery test: (Use `node --trace-warnings ...` to show where the warning was created)containers/runner test:  ✓ test/relay.test.ts (4 tests) 1807mscontainers/runner test:      ✓ splits a single-PUT upload (containerd) into PATCH chunks under the limit  405mscontainers/runner test:      ✓ answers a streamed PATCH (docker) like the registry would, then completes with an empty PUT  1142msapps/diffinery test: stderr | test/unit/suppression.test.ts > Email Sending's answer to a send > puts a refused recipient on the list (source send) and audits it; temporary failures change nothingapps/diffinery test: email failed test Ann@Example.com E_RECIPIENT_SUPPRESSED: recipient is suppressedapps/diffinery test: stderr | test/unit/suppression.test.ts > Email Sending's answer to a send > puts a refused recipient on the list (source send) and audits it; temporary failures change nothingapps/diffinery test: email failed test bob@example.com E_DAILY_LIMIT_EXCEEDED: nopeapps/diffinery test: stderr | test/unit/moderation.test.ts > suspension > refuses tokens and sessions at once, stops Actions, and unsuspending restores the tokensapps/diffinery test: mail queue not bound; dropping 1 email(s)apps/diffinery test: stderr | test/unit/moderation.test.ts > suspension > refuses tokens and sessions at once, stops Actions, and unsuspending restores the tokensapps/diffinery test: mail queue not bound; dropping 1 email(s)apps/diffinery test:  ✓ test/unit/suppression.test.ts (11 tests) 722msapps/diffinery test:  ✓ test/unit/moderation.test.ts (9 tests) 893msapps/cli test:  ✓ test/misc.test.ts (9 tests) 713msapps/cli test:  ✓ test/pr.test.ts (18 tests) 2889msapps/cli test:      ✓ pr create infers the repo from origin and the head from the current branch  318msapps/cli test:      ✓ pr view, checks, diff, comment, review, ready and merge default to the current branch's pull request  684msapps/cli test:      ✓ pr checks --watch waits for the first check right after a push, and gives up after 2 minutes  949msapps/cli test:  ✓ test/migrate.test.ts (4 tests) 2934msapps/cli test:      ✓ creates the repo, pushes branches and tags, and copies issues, PRs, variables and secret names  934msapps/cli test:      ✓ repo clone authenticates for that command only  1104msapps/cli test:      ✓ --private and --to override the target  612msapps/cli test:  Test Files  4 passed (4)apps/cli test:       Tests  43 passed (43)apps/cli test:    Start at  14:33:44apps/cli test:    Duration  5.63s (transform 3.82s, setup 0ms, import 6.74s, tests 7.43s, environment 1ms)apps/diffinery test: (node:864) ExperimentalWarning: SQLite is an experimental feature and might change at any timeapps/diffinery test: (Use `node --trace-warnings ...` to show where the warning was created)containers/runner test:  ✓ test/runtime.test.ts (11 tests) 2886mscontainers/runner test:      ✓ writes archives unzip reads, and reads archives zip writes  465mscontainers/runner test:      ✓ uploads large files as blocks, small ones in one request, and downloads them back  2204msapps/cli test: Doneapps/diffinery test:  ✓ test/unit/review.test.ts (19 tests) 153msapps/diffinery test:  ✓ test/unit/runner-sizes.test.ts (19 tests) 1222msapps/diffinery test:      ✓ runs a first job large, then sizes it by what it used  592msapps/diffinery test:  ✓ test/unit/job-permissions.test.ts (8 tests) 69msapps/diffinery test:  ✓ test/unit/today.test.ts (10 tests) 47msapps/diffinery test:  ✓ test/unit/auto-merge.test.ts (12 tests) 679msapps/diffinery test: (node:1198) ExperimentalWarning: SQLite is an experimental feature and might change at any timeapps/diffinery test: (Use `node --trace-warnings ...` to show where the warning was created)apps/diffinery test: stderr | test/unit/rate-limit.test.ts > rate limit checks > lets requests through when no limiter is configured or the limiter failsapps/diffinery test: rate limiter failed RL_ANON Error: downapps/diffinery test:     at Object.limit (/workspace/diffinery/apps/diffinery/test/unit/rate-limit.test.ts:89:67)apps/diffinery test:     at overLimit (/workspace/diffinery/apps/diffinery/src/lib/rate-limit.ts:71:22)apps/diffinery test:     at /workspace/diffinery/apps/diffinery/test/unit/rate-limit.test.ts:90:18apps/diffinery test:     at process.processTicksAndRejections (node:internal/process/task_queues:105:5)apps/diffinery test: stderr | test/unit/killswitch.test.ts > kill switches > counts repositories that couldn't be stopped, and needs a reasonapps/diffinery test: kill switch: stopping work in repository broken failed Error: goneapps/diffinery test:     at Object.stopActions (/workspace/diffinery/apps/diffinery/test/unit/killswitch.test.ts:24:36)apps/diffinery test:     at worker (/workspace/diffinery/apps/diffinery/src/lib/killswitch.ts:155:63)apps/diffinery test:     at Function.from (<anonymous>)apps/diffinery test:     at stopIn (/workspace/diffinery/apps/diffinery/src/lib/killswitch.ts:166:27)apps/diffinery test:     at changePause (/workspace/diffinery/apps/diffinery/src/lib/killswitch.ts:225:21)apps/diffinery test:     at process.processTicksAndRejections (node:internal/process/task_queues:105:5)apps/diffinery test:     at /workspace/diffinery/apps/diffinery/test/unit/killswitch.test.ts:123:12apps/diffinery test:     at async file:///workspace/diffinery/node_modules/.pnpm/@vitest+runner@4.1.11/node_modules/@vitest/runner/dist/chunk-artifact.js:1903:20apps/diffinery test:  ✓ test/unit/killswitch.test.ts (5 tests) 307msapps/diffinery test:  ✓ test/unit/coordinator.test.ts (8 tests) 22msapps/diffinery test:  ✓ test/unit/secret-scan.test.ts (7 tests) 1289msapps/diffinery test:      ✓ scans large blobs from their compressed bytes, slice by slice, with the same rules  333msapps/diffinery test:      ✓ scans a large file in slices, never as one string, with the same results  925mscontainers/runner test:  ✓ test/import.test.ts (7 tests) 9603mscontainers/runner test:      ✓ pushes history in chunks under a size limit the server enforces, then every ref, and cleans up  4816mscontainers/runner test:      ✓ pushes every version of a large file first and whole, so the server never rebuilds one from a delta  3478mscontainers/runner test:      ✓ splits a refused batch of a large commit's files again, rather than retrying it whole  1277msapps/diffinery test:  ✓ test/unit/job-graph.test.ts (12 tests) 62msapps/diffinery test:  ✓ test/unit/project.test.ts (12 tests) 33msapps/diffinery test: (node:1816) ExperimentalWarning: SQLite is an experimental feature and might change at any timeapps/diffinery test: (Use `node --trace-warnings ...` to show where the warning was created)apps/diffinery test:  ✓ test/unit/job-token.test.ts (7 tests) 270msapps/diffinery test: (node:1827) ExperimentalWarning: SQLite is an experimental feature and might change at any timeapps/diffinery test: (Use `node --trace-warnings ...` to show where the warning was created)apps/diffinery test:  ✓ test/unit/visibility.test.ts (3 tests) 449msapps/diffinery test: stderr | test/unit/rate-limit.test.ts > model requests per paying person (phase 5a) > counts per person, and lets requests through without a binding or when it failsapps/diffinery test: model rate limiter failed Error: downapps/diffinery test:     at Object.limit (/workspace/diffinery/apps/diffinery/test/unit/rate-limit.test.ts:130:61)apps/diffinery test:     at modelRateLimited (/workspace/diffinery/apps/diffinery/src/lib/rate-limit.ts:90:33)apps/diffinery test:     at /workspace/diffinery/apps/diffinery/test/unit/rate-limit.test.ts:131:18apps/diffinery test:     at process.processTicksAndRejections (node:internal/process/task_queues:105:5)apps/diffinery test:     at async file:///workspace/diffinery/node_modules/.pnpm/@vitest+runner@4.1.11/node_modules/@vitest/runner/dist/chunk-artifact.js:1903:20apps/diffinery test:  ✓ test/unit/rate-limit.test.ts (10 tests) 8231msapps/diffinery test:      ✓ answers 429 with retry-after once an anonymous address is over its limit  8137msapps/diffinery test:  ✓ test/unit/reusable.test.ts (4 tests) 73msapps/diffinery test:  ❯ test/unit/markdown-safety.test.ts (28 tests | 1 failed) 2068msapps/diffinery test:      ✓ renders a fence followed by spaces and a backtick in linear time 38msapps/diffinery test:      ✓ renders a heading with trailing spaces before a line separator in linear time 24msapps/diffinery test:      ✓ renders a heading with spaces before text in linear time 11msapps/diffinery test:      ✓ renders a list item with spaces before a line separator in linear time 2msapps/diffinery test:      ✓ renders a table delimiter row with spaces before text in linear time 10msapps/diffinery test:      ✓ renders a dash run with spaces before text in linear time 11msapps/diffinery test:      ✓ bounds the lookahead for unclosed links 266msapps/diffinery test:      ✓ bounds the lookahead for unclosed images 186msapps/diffinery test:      × bounds the lookahead for emphasis openers that never close 698msapps/diffinery test:      ✓ bounds the lookahead for list items of emphasis openers 75msapps/diffinery test:      ✓ bounds the lookahead for many such paragraphs  392msapps/diffinery test:      ✓ formats ordinary text in full 88msapps/diffinery test:      ✓ still parses headings, fences, lists and tables 3msapps/diffinery test:      ✓ refuses paths that browsers resolve to another site 2msapps/diffinery test:      ✓ refuses Markdown links that start with a slash and a backslash in either order 14msapps/diffinery test:      ✓ renders short lines in linear time 75msapps/diffinery test:      ✓ renders hard line breaks in linear time 20msapps/diffinery test:      ✓ renders a long tilde run in linear time 25msapps/diffinery test:      ✓ renders a long backtick run in linear time 3msapps/diffinery test:      ✓ keeps hard line breaks 0msapps/diffinery test:      ✓ hides a comment on its own lines, as GitHub does 1msapps/diffinery test:      ✓ ends a paragraph at a comment line and renders what follows the close 0msapps/diffinery test:      ✓ hides comments inside text, headings, lists, quotes and tables 1msapps/diffinery test:      ✓ keeps comments in code, escaped and unclosed ones as text 1msapps/diffinery test:      ✓ hides the rest of the document after a comment line that never closes, as GitHub does 0msapps/diffinery test:      ✓ never lets markup through around a comment 0msapps/diffinery test:      ✓ renders many comment openers in linear time 81msapps/diffinery test:      ✓ strips comments from plain text, outside code 1msapps/diffinery test:  ✓ test/unit/fsck.test.ts (16 tests) 981msapps/diffinery test:      ✓ refuses a tree too large to check, before reading its names  944msapps/diffinery test:  ✓ test/unit/deploy-log-notes.test.ts (2 tests) 250msapps/diffinery test:  ✓ test/unit/required.test.ts (11 tests) 19msapps/diffinery test:  ✓ test/unit/redirects.test.ts (9 tests) 12msapps/diffinery test:  ✓ test/unit/registry-upload.test.ts (2 tests) 935msapps/diffinery test:      ✓ hash each chunk as it arrives, so the final request doesn't read the blob back  825msapps/diffinery test:  ✓ test/unit/push-retry.test.ts (4 tests) 19msapps/diffinery test:  ✓ test/unit/wait-timer.test.ts (5 tests) 11msapps/diffinery test:  ✓ test/unit/org-variables.test.ts (2 tests) 24msapps/diffinery test:  ✓ test/unit/stages.test.ts (3 tests) 15msapps/diffinery test:  ✓ test/unit/d1.test.ts (3 tests) 13msapps/diffinery test:  ✓ test/unit/receive-head.test.ts (2 tests) 42msapps/diffinery test:  ✓ test/unit/environment-secrets.test.ts (4 tests) 11msapps/diffinery test:  ✓ test/unit/upload-pack.test.ts (1 test) 2038msapps/diffinery test:      ✓ sends each object as it is read, in side-band packets, never the whole pack at once  2034msapps/diffinery test:  ✓ test/unit/job-secrets.test.ts (4 tests) 19msapps/diffinery test:  ✓ test/unit/tree-names.test.ts (5 tests) 19msapps/diffinery test: (node:2117) ExperimentalWarning: SQLite is an experimental feature and might change at any timeapps/diffinery test: (Use `node --trace-warnings ...` to show where the warning was created)apps/diffinery test:  ✓ test/unit/inflight.test.ts (1 test) 51msapps/diffinery test:  ✓ test/unit/archive-stream.test.ts (3 tests) 771msapps/diffinery test:      ✓ refuse more entries than classic zip can hold instead of writing a broken archive  477msapps/diffinery test:  ✓ test/unit/terminal-command.test.ts (1 test) 9msapps/diffinery test:  ✓ test/unit/unpack-failure.test.ts (2 tests) 14msapps/diffinery test:  ✓ test/unit/graphql.test.ts (3 tests) 24msapps/diffinery test: ⎯⎯⎯⎯⎯⎯⎯ Failed Tests 1 ⎯⎯⎯⎯⎯⎯⎯apps/diffinery test:  FAIL  test/unit/markdown-safety.test.ts > markdown block patterns > bounds the lookahead for emphasis openers that never closeapps/diffinery test: AssertionError: expected 687.8271760000007 to be less than 500apps/diffinery test:  ❯ test/unit/markdown-safety.test.ts:36:30apps/diffinery test:      35|   });apps/diffinery test:      36|apps/diffinery test:      37|   it("formats ordinary text in full", () => {apps/diffinery test:        |                             ^apps/diffinery test:      38|     const text = Array.from({ length: 2000 }, (_, i) => `Item ${i} has…apps/diffinery test:      39|     const html = renderMarkdown(text);apps/diffinery test: ⎯⎯⎯⎯⎯⎯⎯⎯⎯⎯⎯⎯⎯⎯⎯⎯⎯⎯⎯⎯⎯⎯⎯⎯[1/1]⎯apps/diffinery test:  Test Files  1 failed | 37 passed (38)apps/diffinery test:       Tests  1 failed | 289 passed (290)apps/diffinery test:    Start at  14:33:44apps/diffinery test:    Duration  21.99s (transform 16.42s, setup 0ms, import 24.30s, tests 22.05s, environment 18ms)apps/diffinery test: ::error file=/workspace/diffinery/apps/diffinery/test/unit/markdown-safety.test.ts,title=test/unit/markdown-safety.test.ts > markdown block patterns > bounds the lookahead for emphasis openers that never close,line=36,column=30::AssertionError: expected 687.8271760000007 to be less than 500%0A ❯ test/unit/markdown-safety.test.ts:36:30%0A%0Aapps/diffinery test: Failed/workspace/diffinery/apps/diffinery: ERR_PNPM_RECURSIVE_RUN_FIRST_FAIL  @diffinery/app@0.1.0 test: `vitest run --passWithNoTests --exclude 'test/e2e/**' --shard=1/2`Exit status 1##[error]Process completed with exit code 1.
Post Run pnpm/action-setup@b906affcce14559ad1aafd4ab0e942779e9f58b10s
Pruning is unnecessary.
Post Run actions/checkout@v40s
Removing persisted credentials

Job summary

Vitest Test Report

Summary

  • Test Files: ✅ 3 passes · 3 total
  • Test Results: ✅ 102 passes · 102 total

Vitest Test Report

Summary

  • Test Files: ✅ 3 passes · 3 total
  • Test Results: ✅ 14 passes · 14 total

Vitest Test Report

Summary

  • Test Files: ✅ 4 passes · 4 total
  • Test Results: ✅ 43 passes · 43 total

Vitest Test Report

Summary

  • Test Files: ❌ 1 failure · ✅ 37 passes · 38 total
  • Test Results: ❌ 1 failure · ✅ 289 passes · 290 total