Diffinery

codician/diffinerypublic

Open-source, agent-first GitHub and GitHub Actions alternative that runs on your own Cloudflare account: git hosting, pull requests, code review and drop-in GitHub Actions YAML on Workers, Durable Objects, R2 and Containers.

End-to-end (real histories)

took 2m 5s Raw logs

Matrix: name: real histories, shard: histories

Failed at Run the shard's tests
Process completed with exit code 1.

    1..4
not ok 1 - real histories: whole projects, side by side
  ---
  duration_ms: 106003.186291
  type: 'suite'
  location: '/workspace/diffinery/apps/diffinery/test/e2e/e2e.test.mjs:2919:1'
  failureType: 'subtestsFailed'
  error: '1 subtest failed'
  code: 'ERR_TEST_FAILURE'
  ...
1..1
# tests 4
# suites 1
# pass 3
# fail 1
# cancelled 0
# skipped 0
# todo 0
# duration_ms 108257.599015
Set up job
Diffinery runner: job e2e (End-to-end (real histories)) for codician/diffinery@6fe6669f8bf8Runner: image diffinery-runner:efee6389dfc1b5bd5a743d5e, in cdg09, WEUR, container 011e009bb4be8573bb2c0a4a88108aa22630185f165381eb4da2e84c950f899bRunner size: large (4 vCPU, 12 GiB of memory, 20 GB of disk), an earlier run of this job wasn't measured; runs-on: diffinery-large (or -medium, -small, -tiny) sets a sizeHost: AMD EPYC (family 25, model 17), 4 vCPUs, 2546 MHzWorkspace: /workspace/diffineryHost: 0% of the vCPUs' time went to other work on the host (steal)Job completed with conclusion: failureResources: 2.4 of 4 vCPUs busy on average (4.0 at the 95th percentile), peak memory 9.4 GiB of 11.9 GiB, peak disk 3.1 GB of 19.3 GB
Run actions/checkout@v42s
##[group]Run actions/checkout@v4##[endgroup]Syncing repository: codician/diffineryFetching the repository (depth 1)remote: Enumerating objects: 688, done.        Receiving objects:   0% (1/688)
Receiving objects:   1% (7/688)
Receiving objects:   2% (14/688)
Receiving objects:   3% (21/688)
Receiving objects:   4% (28/688)
Receiving objects:   5% (35/688)
Receiving objects:   6% (42/688)
Receiving objects:   7% (49/688)
Receiving objects:   8% (56/688)
Receiving objects:   9% (62/688)
Receiving objects:  10% (69/688)
Receiving objects:  11% (76/688)
Receiving objects:  12% (83/688)
Receiving objects:  13% (90/688)
Receiving objects:  14% (97/688)
Receiving objects:  15% (104/688)
Receiving objects:  16% (111/688)
Receiving objects:  17% (117/688)
Receiving objects:  18% (124/688), 771.75 KiB | 1.40 MiB/s
Receiving objects:  19% (131/688), 771.75 KiB | 1.40 MiB/s
Receiving objects:  20% (138/688), 771.75 KiB | 1.40 MiB/s
Receiving objects:  21% (145/688), 771.75 KiB | 1.40 MiB/s
Receiving objects:  22% (152/688), 771.75 KiB | 1.40 MiB/s
Receiving objects:  23% (159/688), 771.75 KiB | 1.40 MiB/s
Receiving objects:  24% (166/688), 771.75 KiB | 1.40 MiB/s
Receiving objects:  25% (172/688), 771.75 KiB | 1.40 MiB/s
Receiving objects:  26% (179/688), 771.75 KiB | 1.40 MiB/s
Receiving objects:  27% (186/688), 771.75 KiB | 1.40 MiB/s
Receiving objects:  28% (193/688), 771.75 KiB | 1.40 MiB/s
Receiving objects:  29% (200/688), 771.75 KiB | 1.40 MiB/s
Receiving objects:  30% (207/688), 771.75 KiB | 1.40 MiB/s
Receiving objects:  31% (214/688), 771.75 KiB | 1.40 MiB/s
Receiving objects:  32% (221/688), 771.75 KiB | 1.40 MiB/s
Receiving objects:  33% (228/688), 771.75 KiB | 1.40 MiB/s
Receiving objects:  34% (234/688), 771.75 KiB | 1.40 MiB/s
Receiving objects:  35% (241/688), 771.75 KiB | 1.40 MiB/s
Receiving objects:  36% (248/688), 771.75 KiB | 1.40 MiB/s
Receiving objects:  37% (255/688), 771.75 KiB | 1.40 MiB/s
Receiving objects:  38% (262/688), 771.75 KiB | 1.40 MiB/s
Receiving objects:  39% (269/688), 771.75 KiB | 1.40 MiB/s
Receiving objects:  40% (276/688), 771.75 KiB | 1.40 MiB/s
Receiving objects:  41% (283/688), 771.75 KiB | 1.40 MiB/s
Receiving objects:  42% (289/688), 771.75 KiB | 1.40 MiB/s
Receiving objects:  43% (296/688), 771.75 KiB | 1.40 MiB/s
Receiving objects:  44% (303/688), 771.75 KiB | 1.40 MiB/s
Receiving objects:  45% (310/688), 771.75 KiB | 1.40 MiB/s
Receiving objects:  46% (317/688), 771.75 KiB | 1.40 MiB/s
Receiving objects:  47% (324/688), 771.75 KiB | 1.40 MiB/s
Receiving objects:  48% (331/688), 771.75 KiB | 1.40 MiB/s
Receiving objects:  49% (338/688), 771.75 KiB | 1.40 MiB/s
Receiving objects:  50% (344/688), 771.75 KiB | 1.40 MiB/s
Receiving objects:  51% (351/688), 771.75 KiB | 1.40 MiB/s
Receiving objects:  52% (358/688), 771.75 KiB | 1.40 MiB/s
Receiving objects:  53% (365/688), 771.75 KiB | 1.40 MiB/s
Receiving objects:  54% (372/688), 771.75 KiB | 1.40 MiB/s
Receiving objects:  55% (379/688), 771.75 KiB | 1.40 MiB/s
Receiving objects:  56% (386/688), 771.75 KiB | 1.40 MiB/s
Receiving objects:  57% (393/688), 771.75 KiB | 1.40 MiB/s
Receiving objects:  58% (400/688), 771.75 KiB | 1.40 MiB/s
Receiving objects:  59% (406/688), 771.75 KiB | 1.40 MiB/s
Receiving objects:  60% (413/688), 771.75 KiB | 1.40 MiB/s
Receiving objects:  61% (420/688), 771.75 KiB | 1.40 MiB/s
Receiving objects:  62% (427/688), 771.75 KiB | 1.40 MiB/s
Receiving objects:  63% (434/688), 771.75 KiB | 1.40 MiB/s
Receiving objects:  64% (441/688), 771.75 KiB | 1.40 MiB/s
Receiving objects:  65% (448/688), 771.75 KiB | 1.40 MiB/s
Receiving objects:  66% (455/688), 771.75 KiB | 1.40 MiB/s
Receiving objects:  67% (461/688), 771.75 KiB | 1.40 MiB/s
Receiving objects:  68% (468/688), 771.75 KiB | 1.40 MiB/s
Receiving objects:  69% (475/688), 771.75 KiB | 1.40 MiB/s
Receiving objects:  70% (482/688), 771.75 KiB | 1.40 MiB/s
Receiving objects:  71% (489/688), 771.75 KiB | 1.40 MiB/s
Receiving objects:  72% (496/688), 771.75 KiB | 1.40 MiB/s
Receiving objects:  73% (503/688), 771.75 KiB | 1.40 MiB/s
Receiving objects:  74% (510/688), 771.75 KiB | 1.40 MiB/s
Receiving objects:  75% (516/688), 771.75 KiB | 1.40 MiB/s
Receiving objects:  76% (523/688), 771.75 KiB | 1.40 MiB/s
Receiving objects:  77% (530/688), 771.75 KiB | 1.40 MiB/s
Receiving objects:  78% (537/688), 771.75 KiB | 1.40 MiB/s
Receiving objects:  79% (544/688), 771.75 KiB | 1.40 MiB/s
Receiving objects:  80% (551/688), 771.75 KiB | 1.40 MiB/s
Receiving objects:  81% (558/688), 771.75 KiB | 1.40 MiB/s
Receiving objects:  82% (565/688), 771.75 KiB | 1.40 MiB/s
Receiving objects:  83% (572/688), 771.75 KiB | 1.40 MiB/s
Receiving objects:  84% (578/688), 771.75 KiB | 1.40 MiB/s
Receiving objects:  85% (585/688), 771.75 KiB | 1.40 MiB/s
Receiving objects:  86% (592/688), 771.75 KiB | 1.40 MiB/s
Receiving objects:  87% (599/688), 771.75 KiB | 1.40 MiB/s
Receiving objects:  88% (606/688), 771.75 KiB | 1.40 MiB/s
Receiving objects:  89% (613/688), 771.75 KiB | 1.40 MiB/s
Receiving objects:  90% (620/688), 771.75 KiB | 1.40 MiB/s
Receiving objects:  91% (627/688), 771.75 KiB | 1.40 MiB/s
Receiving objects:  92% (633/688), 771.75 KiB | 1.40 MiB/s
Receiving objects:  93% (640/688), 771.75 KiB | 1.40 MiB/s
Receiving objects:  94% (647/688), 771.75 KiB | 1.40 MiB/s
Receiving objects:  95% (654/688), 771.75 KiB | 1.40 MiB/s
Receiving objects:  96% (661/688), 771.75 KiB | 1.40 MiB/s
Receiving objects:  97% (668/688), 771.75 KiB | 1.40 MiB/s
remote: Total 688 (delta 0), reused 688 (delta 0)        Receiving objects:  98% (675/688), 771.75 KiB | 1.40 MiB/s
Receiving objects:  99% (682/688), 771.75 KiB | 1.40 MiB/s
Receiving objects: 100% (688/688), 771.75 KiB | 1.40 MiB/s
Receiving objects: 100% (688/688), 3.05 MiB | 5.01 MiB/s, done.From https://diffinery.com/codician/diffinery * [new ref]         6fe6669f8bf8a2b8b0186c1aa7e8c58e4027ea7d -> origin/diffinery-checkoutNote: switching to '6fe6669f8bf8a2b8b0186c1aa7e8c58e4027ea7d'.You are in 'detached HEAD' state. You can look around, make experimentalchanges and commit them, and you can discard any commits you make in thisstate without impacting any branches by switching back to a branch.If you want to create a new branch to retain commits you create, you maydo so (now or later) by using -c with the switch command. Example:  git switch -c <new-branch-name>Or undo this operation with:  git switch -Turn off this advice by setting config variable advice.detachedHead to falseHEAD is now at 6fe6669 Merge cfabb9f740ab3ef9da1fd5b589a2f90cedcd911e into bc37204dcc80ca6910c429a75bfebc4b04bacd96HEAD is now at 6fe6669f8bf8a2b8b0186c1aa7e8c58e4027ea7d
Run pnpm/action-setup@b906affcce14559ad1aafd4ab0e942779e9f58b12s
Download action repository 'pnpm/action-setup@b906affcce14559ad1aafd4ab0e942779e9f58b1'##[group]Run pnpm/action-setup@b906affcce14559ad1aafd4ab0e942779e9f58b1with:  dest: ~/setup-pnpm  run_install: null  cache: false  cache_dependency_path: pnpm-lock.yaml  package_json_file: package.json  standalone: false##[endgroup]##[group]Running self-installer...Progress: resolved 1, reused 0, downloaded 0, added 0Packages: +1+Progress: resolved 1, reused 0, downloaded 1, added 1, donedependencies:+ pnpm 10.28.0 (12.14.0 is available)Done in 1.1s##[endgroup]Installation Completed!
Run actions/setup-node@v46s
##[group]Run actions/setup-node@v4with:  node-version: 22  cache: pnpm##[endgroup]Found in cache @ 22.22.0 (pre-installed node satisfies '22')Cache Size: ~216 MB (226493609 B)Cache restored from key: node-cache-Linux-x64-pnpm-a02ba8dce5cb7329b868883337d1a03f862819a15859861dae22d3a8b1092f41
Run pnpm install --frozen-lockfile3s
##[group]Run pnpm install --frozen-lockfile##[endgroup]Scope: all 8 workspace projectsLockfile is up to date, resolution step is skippedProgress: resolved 1, reused 0, downloaded 0, added 0Packages: +250++++++++++++++++++++++++++++++++++++++++++++++++++++++++++++++++++++++++++++++++Progress: resolved 250, reused 244, downloaded 0, added 249Progress: resolved 250, reused 244, downloaded 0, added 250, done.../esbuild@0.25.12/node_modules/esbuild postinstall$ node install.js.../node_modules/workerd postinstall$ node install.js.../esbuild@0.28.1/node_modules/esbuild postinstall$ node install.js.../node_modules/workerd postinstall$ node install.js.../esbuild@0.25.11/node_modules/esbuild postinstall$ node install.js.../esbuild@0.25.12/node_modules/esbuild postinstall: Done.../esbuild@0.28.1/node_modules/esbuild postinstall: Done.../esbuild@0.28.2/node_modules/esbuild postinstall$ node install.js.../esbuild@0.25.11/node_modules/esbuild postinstall: Done.../node_modules/workerd postinstall: Done.../node_modules/workerd postinstall: Done.../esbuild@0.28.2/node_modules/esbuild postinstall: DonedevDependencies:+ turbo 2.11.7+ typescript 5.9.3Done in 3s using pnpm v10.28.0
Run pnpm -r --if-present build2s
##[group]Run pnpm -r --if-present build##[endgroup]Scope: 7 of 8 workspace projectsapps/cli build$ esbuild src/bin.ts --bundle --platform=node --target=node22 --format=esm --outfile=dist/diffinery.mjs "--banner:js=#!/usr/bin/env nodeimport { createRequire as __diffineryCreateRequire } from 'node:module'; const require = __diffineryCreateRequire(import.meta.url);"apps/diffinery build$ node islands/build.mjs && node scripts/build-docs.mjscontainers/runner build$ esbuild src/main.ts --bundle --platform=node --target=node22 --format=esm --outfile=dist/agent.mjs --external:bufferutil --external:utf-8-validate "--banner:js=import { createRequire as __diffineryCreateRequire } from 'node:module'; const require = __diffineryCreateRequire(import.meta.url);"apps/cli build:   dist/diffinery.mjs  446.1kbapps/cli build: ⚡ Done in 56msapps/cli build: Donecontainers/runner build:   dist/agent.mjs  682.1kbcontainers/runner build: ⚡ Done in 75mscontainers/runner build: Doneapps/diffinery build: islands: kumo.js 466 KB, kumo.css 149 KB, terminal.js 286 KBapps/diffinery build: docs: 72 pages (+2 generated at runtime), 6 images, CLI 0.1.0 (235 KiB), editor extension 0.1.1 (20 KiB)apps/diffinery build: Done
Run pnpm --filter @diffinery/app exec playwright install --with-deps chromium
Run as_root() { if [ "$(id -u)" = 0 ]; then "$@"; else sudo "$@"; fi; }
Run the shard's tests1m 49s
##[group]Run # Shards of similar length; a new test file runs in "rest" unless it's added to another.core='/e2e\.test\.mjs$'agents='/(agentic|review|tasks)\.test\.mjs$'# security.test.mjs, security-*.test.mjs (security-txt's too) and status.test.mjs.security='/(security(-[a-z-]+)?|status)\.test\.mjs$'# The core file's real histories and large pushes take minutes each (jquery's alone 2 to 3 on# Diffinery's runners): two shards of their own, so no part of the file runs into node's# per-file timeout, which is the --test-timeout here.histories='^real histories:'large='^(large files|large pushes):'opts=(--test-timeout=600000)case "histories" in  core) files=$(ls test/e2e/*.test.mjs | grep -E "$core"); opts+=(--test-skip-pattern="$histories" --test-skip-pattern="$large") ;;  histories) files=$(ls test/e2e/*.test.mjs | grep -E "$core"); opts=(--test-timeout=900000 --test-name-pattern="$histories") ;;  large) files=$(ls test/e2e/*.test.mjs | grep -E "$core"); opts+=(--test-name-pattern="$large") ;;  agents) files=$(ls test/e2e/*.test.mjs | grep -E "$agents") ;;  security) files=$(ls test/e2e/*.test.mjs | grep -E "$security") ;;  *) files=$(ls test/e2e/*.test.mjs | grep -vE "$core|$agents|$security") ;;esacecho "$files"# Two files at a time: each starts its own local server on its own port, database and# directory, so they don't share state, and a file's server mostly keeps one core busy.node --test --test-concurrency=2 "${opts[@]}" $files##[endgroup]test/e2e/e2e.test.mjsTAP version 13# Subtest: real histories: whole projects, side by side    # Subtest: real histories: jquery's whole history goes in one push and clones back intact    ok 1 - real histories: jquery's whole history goes in one push and clones back intact      ---      duration_ms: 86984.79922      type: 'test'      ...    # Subtest: real histories: tornado's whole history goes in one push and clones back intact    ok 2 - real histories: tornado's whole history goes in one push and clones back intact      ---      duration_ms: 65090.311014      type: 'test'      ...    # Subtest: real histories: flask's whole history goes in one push and clones back intact    not ok 3 - real histories: flask's whole history goes in one push and clones back intact      ---      duration_ms: 55897.694349      type: 'test'      location: '/workspace/diffinery/apps/diffinery/test/e2e/e2e.test.mjs:2927:5'      failureType: 'testCodeFailure'      error: |-        git clone -q --bare http://127.0.0.1:38079/dev/flask.git /tmp/diffinery-e2e-M0skod/flask-clone exited 128        error: RPC failed; curl 7 Failed to connect to 127.0.0.1 port 38079 after 0 ms: Couldn't connect to server        fatal: expected 'packfile'                the Worker was at http://127.0.0.1:38079; wrangler dev now names http://127.0.0.1:38079        --- wrangler log tail ---        ontainers/get-started/#configuration                         ✘ [ERROR] Uncaught Error: Containers have not been enabled for this Durable Object class. Have you correctly setup your Wrangler config? More info: https://developers.cloudflare.com/containers/get-started/#configuration Error                      at Container (file:///workspace/diffinery/node_modules/.pnpm/@cloudflare+containers@0.3.7/node_modules/@cloudflare/containers/src/lib/container.ts:533:13)              at HostedContainer (file:///workspace/diffinery/apps/diffinery/src/runner/containers.ts:19:5)              at RunnerContainer (file:///workspace/diffinery/apps/diffinery/src/runner/containers.ts:51:8)              at RunnerContainer (file:///workspace/diffinery/node_modules/.pnpm/miniflare@5.20261006.1-alpha_@types+node@22.20.5/node_modules/miniflare/dist/src/workers/core/do-wrapper.worker.js:10:7)                        ✘ [ERROR] Uncaught Error: Containers have not been enabled for this Durable Object class. Have you correctly setup your Wrangler config? More info: https://developers.cloudflare.com/containers/get-started/#configuration                         ▲ [WARNING] NOSENTRY reporting trace with exception outcome, but no actual exceptions; trace->eventInfo = JsRpcEventInfo:                         ✘ [ERROR] Uncaught Error: Containers have not been enabled for this Durable Object class. Have you correctly setup your Wrangler config? More info: https://developers.cloudflare.com/containers/get-started/#configuration Error                      at Container (file:///workspace/diffinery/node_modules/.pnpm/@cloudflare+containers@0.3.7/node_modules/@cloudflare/containers/src/lib/container.ts:533:13)              at HostedContainer (file:///workspace/diffinery/apps/diffinery/src/runner/containers.ts:19:5)              at RunnerContainer (file:///workspace/diffinery/apps/diffinery/src/runner/containers.ts:51:8)              at RunnerContainer (file:///workspace/diffinery/node_modules/.pnpm/miniflare@5.20261006.1-alpha_@types+node@22.20.5/node_modules/miniflare/dist/src/workers/core/do-wrapper.worker.js:10:7)                        ✘ [ERROR] Uncaught Error: Containers have not been enabled for this Durable Object class. Have you correctly setup your Wrangler config? More info: https://developers.cloudflare.com/containers/get-started/#configuration                         ✘ [ERROR] Uncaught Error: Containers have not been enabled for this Durable Object class. Have you correctly setup your Wrangler config? More info: https://developers.cloudflare.com/containers/get-started/#configuration                         ✘ [ERROR] Uncaught Error: Containers have not been enabled for this Durable Object class. Have you correctly setup your Wrangler config? More info: https://developers.cloudflare.com/containers/get-started/#configuration Error                      at Container (file:///workspace/diffinery/node_modules/.pnpm/@cloudflare+containers@0.3.7/node_modules/@cloudflare/containers/src/lib/container.ts:533:13)              at HostedContainer (file:///workspace/diffinery/apps/diffinery/src/runner/containers.ts:19:5)              at RunnerContainer (file:///workspace/diffinery/apps/diffinery/src/runner/containers.ts:51:8)              at RunnerContainer (file:///workspace/diffinery/node_modules/.pnpm/miniflare@5.20261006.1-alpha_@types+node@22.20.5/node_modules/miniflare/dist/src/workers/core/do-wrapper.worker.js:10:7)                        ✘ [ERROR] Uncaught Error: Containers have not been enabled for this Durable Object class. Have you correctly setup your Wrangler config? More info: https://developers.cloudflare.com/containers/get-started/#configuration                         [wrangler:info] QUEUE diffinery-events-dev 5/5 (265ms)        [wrangler:info] QUEUE diffinery-mail-dev 2/2 (33ms)        [wrangler:warn] The Workers runtime crashed unexpectedly and is being restarted (crash #1). Any additional runtime output above may indicate the cause.              code: 'ERR_TEST_FAILURE'      stack: |-        ChildProcess.<anonymous> (file:///workspace/diffinery/apps/diffinery/test/e2e/e2e.test.mjs:2853:26)        ChildProcess.emit (node:events:519:28)        maybeClose (node:internal/child_process:1101:16)        ChildProcess._handle.onexit (node:internal/child_process:304:5)      ...    # Subtest: real histories: a 2.6 MB lockfile's 60 versions, a chain of deltas, go in one small push    ok 4 - real histories: a 2.6 MB lockfile's 60 versions, a chain of deltas, go in one small push      ---      duration_ms: 39947.098866      type: 'test'      ...    1..4not ok 1 - real histories: whole projects, side by side  ---  duration_ms: 106003.186291  type: 'suite'  location: '/workspace/diffinery/apps/diffinery/test/e2e/e2e.test.mjs:2919:1'  failureType: 'subtestsFailed'  error: '1 subtest failed'  code: 'ERR_TEST_FAILURE'  ...1..1# tests 4# suites 1# pass 3# fail 1# cancelled 0# skipped 0# todo 0# duration_ms 108257.599015##[error]Process completed with exit code 1.
Post Run pnpm/action-setup@b906affcce14559ad1aafd4ab0e942779e9f58b10s
Pruning is unnecessary.
Post Run actions/checkout@v40s
Removing persisted credentials