Diffinery

codician/diffinerypublic

Open-source, agent-first GitHub and GitHub Actions alternative that runs on your own Cloudflare account: git hosting, pull requests, code review and drop-in GitHub Actions YAML on Workers, Durable Objects, R2 and Containers.

Unit tests (1/2)

took 54s Raw logs

Matrix: shard: 1

Failed at Unit tests
Process completed with exit code 1.

apps/diffinery test:  FAIL  test/unit/markdown-safety.test.ts > markdown over many lines > renders short lines in linear time
apps/diffinery test: AssertionError: expected 548.5127480000001 to be less than 500
apps/diffinery test:  ❯ test/unit/markdown-safety.test.ts:88:30
apps/diffinery test:      87|   });
apps/diffinery test:      88|
apps/diffinery test:      89|   it("keeps hard line breaks", () => {
apps/diffinery test:        |                             ^
apps/diffinery test:      90|     expect(renderMarkdown("one  \ntwo\nthree   \nfour")).toBe("<p>one<…
apps/diffinery test:      91|   });
apps/diffinery test: ⎯⎯⎯⎯⎯⎯⎯⎯⎯⎯⎯⎯⎯⎯⎯⎯⎯⎯⎯⎯⎯⎯⎯⎯[1/1]⎯
apps/diffinery test:  Test Files  1 failed | 37 passed (38)
apps/diffinery test:       Tests  1 failed | 286 passed (287)
apps/diffinery test:    Start at  14:05:32
apps/diffinery test:    Duration  13.31s (transform 9.90s, setup 0ms, import 15.88s, tests 12.90s, environment 6ms)
apps/diffinery test: ::error file=/workspace/diffinery/apps/diffinery/test/unit/markdown-safety.test.ts,title=test/unit/markdown-safety.test.ts > markdown over many lines > renders short lines in linear time,line=88,column=30::AssertionError: expected 548.5127480000001 to be less than 500%0A ❯ test/unit/markdown-safety.test.ts:88:30%0A%0A
apps/diffinery test: Failed
/workspace/diffinery/apps/diffinery:
 ERR_PNPM_RECURSIVE_RUN_FIRST_FAIL  @diffinery/app@0.1.0 test: `vitest run --passWithNoTests --exclude 'test/e2e/**' --shard=1/2`
Exit status 1
Set up job
Diffinery runner: job test (Unit tests (1/2)) for codician/diffinery@ac9367d87591Runner: image diffinery-runner:aeeb9e24ddf78dd4d8e258a7, in cdg14, WEUR, container f5c2a53291226a3756bfb25c0bd54508d789463b48cbf32a33a6f318a8debdc2Runner size: large (4 vCPU, 12 GiB of memory, 20 GB of disk), an earlier run of this job wasn't measured; runs-on: diffinery-large (or -medium, -small, -tiny) sets a sizeWorkspace: /workspace/diffineryJob completed with conclusion: failureResources: 1.8 of 4 vCPUs busy on average (3.7 at the 95th percentile), peak memory 2.7 GiB of 11.9 GiB, peak disk 2.3 GB of 19.3 GB
Run actions/checkout@v42s
##[group]Run actions/checkout@v4##[endgroup]Syncing repository: codician/diffineryFetching the repository (depth 1)remote: Enumerating objects: 622, done.        Receiving objects:   0% (1/622)
Receiving objects:   1% (7/622)
Receiving objects:   2% (13/622)
Receiving objects:   3% (19/622)
Receiving objects:   4% (25/622)
Receiving objects:   5% (32/622)
Receiving objects:   6% (38/622)
Receiving objects:   7% (44/622)
Receiving objects:   8% (50/622)
Receiving objects:   9% (56/622)
Receiving objects:  10% (63/622)
Receiving objects:  11% (69/622)
Receiving objects:  12% (75/622)
Receiving objects:  13% (81/622)
Receiving objects:  14% (88/622)
Receiving objects:  15% (94/622)
Receiving objects:  16% (100/622)
Receiving objects:  17% (106/622)
Receiving objects:  18% (112/622)
Receiving objects:  19% (119/622)
Receiving objects:  20% (125/622)
Receiving objects:  21% (131/622)
Receiving objects:  22% (137/622)
Receiving objects:  23% (144/622)
Receiving objects:  24% (150/622)
Receiving objects:  25% (156/622)
Receiving objects:  26% (162/622)
Receiving objects:  27% (168/622)
Receiving objects:  28% (175/622)
Receiving objects:  29% (181/622)
Receiving objects:  30% (187/622)
Receiving objects:  31% (193/622)
Receiving objects:  32% (200/622)
Receiving objects:  33% (206/622)
Receiving objects:  34% (212/622)
Receiving objects:  35% (218/622)
Receiving objects:  36% (224/622)
Receiving objects:  37% (231/622)
Receiving objects:  38% (237/622)
Receiving objects:  39% (243/622)
Receiving objects:  40% (249/622)
Receiving objects:  41% (256/622)
Receiving objects:  42% (262/622)
Receiving objects:  43% (268/622)
Receiving objects:  44% (274/622)
Receiving objects:  45% (280/622)
Receiving objects:  46% (287/622)
Receiving objects:  47% (293/622)
Receiving objects:  48% (299/622)
Receiving objects:  49% (305/622)
Receiving objects:  50% (311/622)
Receiving objects:  51% (318/622)
Receiving objects:  52% (324/622)
Receiving objects:  53% (330/622)
Receiving objects:  54% (336/622)
Receiving objects:  55% (343/622)
Receiving objects:  56% (349/622)
Receiving objects:  57% (355/622)
Receiving objects:  58% (361/622)
Receiving objects:  59% (367/622)
Receiving objects:  60% (374/622)
Receiving objects:  61% (380/622)
Receiving objects:  62% (386/622)
Receiving objects:  63% (392/622)
Receiving objects:  64% (399/622)
Receiving objects:  65% (405/622)
Receiving objects:  66% (411/622)
Receiving objects:  67% (417/622)
Receiving objects:  68% (423/622)
Receiving objects:  69% (430/622)
Receiving objects:  70% (436/622)
Receiving objects:  71% (442/622)
Receiving objects:  72% (448/622)
Receiving objects:  73% (455/622)
Receiving objects:  74% (461/622)
Receiving objects:  75% (467/622)
Receiving objects:  76% (473/622)
Receiving objects:  77% (479/622)
Receiving objects:  78% (486/622)
Receiving objects:  79% (492/622)
Receiving objects:  80% (498/622)
Receiving objects:  81% (504/622)
Receiving objects:  82% (511/622)
Receiving objects:  83% (517/622)
Receiving objects:  84% (523/622)
Receiving objects:  85% (529/622)
Receiving objects:  86% (535/622)
Receiving objects:  87% (542/622)
Receiving objects:  88% (548/622)
Receiving objects:  89% (554/622)
Receiving objects:  90% (560/622)
Receiving objects:  91% (567/622)
Receiving objects:  92% (573/622)
Receiving objects:  93% (579/622)
Receiving objects:  94% (585/622)
Receiving objects:  95% (591/622)
Receiving objects:  96% (598/622)
remote: Total 622 (delta 0), reused 622 (delta 0)        Receiving objects:  97% (604/622)
Receiving objects:  98% (610/622)
Receiving objects:  99% (616/622)
Receiving objects: 100% (622/622)
Receiving objects: 100% (622/622), 2.54 MiB | 8.53 MiB/s, done.From https://diffinery.com/codician/diffinery * [new ref]         ac9367d87591d621114311a795541039fd963b1d -> origin/diffinery-checkoutNote: switching to 'ac9367d87591d621114311a795541039fd963b1d'.You are in 'detached HEAD' state. You can look around, make experimentalchanges and commit them, and you can discard any commits you make in thisstate without impacting any branches by switching back to a branch.If you want to create a new branch to retain commits you create, you maydo so (now or later) by using -c with the switch command. Example:  git switch -c <new-branch-name>Or undo this operation with:  git switch -Turn off this advice by setting config variable advice.detachedHead to falseHEAD is now at ac9367d Merge 786b5065041b296b1c7b69ba3728d5cee12d8b83 into c74f242352b9c6271ed267578eb3ec312700c90dHEAD is now at ac9367d87591d621114311a795541039fd963b1d
Run pnpm/action-setup@b906affcce14559ad1aafd4ab0e942779e9f58b13s
Download action repository 'pnpm/action-setup@b906affcce14559ad1aafd4ab0e942779e9f58b1'##[group]Run pnpm/action-setup@b906affcce14559ad1aafd4ab0e942779e9f58b1with:  dest: ~/setup-pnpm  run_install: null  cache: false  cache_dependency_path: pnpm-lock.yaml  package_json_file: package.json  standalone: false##[endgroup]##[group]Running self-installer...Progress: resolved 1, reused 0, downloaded 0, added 0Packages: +1+Progress: resolved 1, reused 0, downloaded 1, added 1, donedependencies:+ pnpm 10.28.0 (12.14.0 is available)Done in 1.7s##[endgroup]Installation Completed!
Run actions/setup-node@v48s
##[group]Run actions/setup-node@v4with:  node-version: 22  cache: pnpm##[endgroup]Found in cache @ 22.22.0 (pre-installed node satisfies '22')Cache Size: ~216 MB (226515969 B)Cache restored from key: node-cache-Linux-x64-pnpm-aa519d0d5d7e5a224fb440987e5331e1cb7b3a95e67805db372d6def9572f2b0
Run pnpm install --frozen-lockfile15s
##[group]Run pnpm install --frozen-lockfile##[endgroup]Scope: all 7 workspace projectsLockfile is up to date, resolution step is skippedProgress: resolved 1, reused 0, downloaded 0, added 0Packages: +249++++++++++++++++++++++++++++++++++++++++++++++++++++++++++++++++++++++++++++++++Progress: resolved 249, reused 243, downloaded 0, added 248Progress: resolved 249, reused 243, downloaded 0, added 249, donedevDependencies:+ turbo 2.11.7+ typescript 5.9.3Done in 14.9s using pnpm v10.28.0
Build2s
##[group]Run pnpm -r --if-present build##[endgroup]Scope: 6 of 7 workspace projectsapps/cli build$ esbuild src/bin.ts --bundle --platform=node --target=node22 --format=esm --outfile=dist/diffinery.mjs "--banner:js=#!/usr/bin/env nodeimport { createRequire as __diffineryCreateRequire } from 'node:module'; const require = __diffineryCreateRequire(import.meta.url);"apps/diffinery build$ node islands/build.mjs && node scripts/build-docs.mjscontainers/runner build$ esbuild src/main.ts --bundle --platform=node --target=node22 --format=esm --outfile=dist/agent.mjs --external:bufferutil --external:utf-8-validate "--banner:js=import { createRequire as __diffineryCreateRequire } from 'node:module'; const require = __diffineryCreateRequire(import.meta.url);"apps/cli build:   dist/diffinery.mjs  444.7kbapps/cli build: ⚡ Done in 60msapps/cli build: Donecontainers/runner build:   dist/agent.mjs  665.1kbcontainers/runner build: ⚡ Done in 103mscontainers/runner build: Doneapps/diffinery build: islands: kumo.js 466 KB, kumo.css 149 KB, terminal.js 286 KBapps/diffinery build: docs: 65 pages (+2 generated at runtime), CLI 0.1.0 (234 KiB)apps/diffinery build: Done
Unit tests24s
##[group]Run pnpm -r --if-present run test --shard=1/2##[endgroup]Scope: 6 of 7 workspace projectspackages/git-core test$ vitest run --shard=1/2packages/workflow-yaml test$ vitest run --shard=1/2packages/workflow-yaml test:  RUN  v4.1.11 /workspace/diffinery/packages/workflow-yamlpackages/git-core test:  RUN  v4.1.11 /workspace/diffinery/packages/git-corepackages/workflow-yaml test:  ✓ test/cron.test.ts (23 tests) 16mspackages/workflow-yaml test:  ✓ test/expr.test.ts (48 tests) 37mspackages/workflow-yaml test:  ✓ test/parse.test.ts (31 tests) 84mspackages/workflow-yaml test:  Test Files  3 passed (3)packages/workflow-yaml test:       Tests  102 passed (102)packages/workflow-yaml test:    Start at  14:05:23packages/workflow-yaml test:    Duration  1.04s (transform 1.32s, setup 0ms, import 1.99s, tests 137ms, environment 0ms)packages/workflow-yaml test: Donepackages/git-core test:  ✓ test/pack-stream.test.ts (3 tests) 286mspackages/git-core test:  ✓ test/diff-budget.test.ts (5 tests) 1012mspackages/git-core test:      ✓ a file rewritten from scratch is diffed in one pass, as one replaced block  324mspackages/git-core test:      ✓ a three-way merge too large to compute is a conflict, quickly  677mspackages/git-core test:  ✓ test/pack-limits.test.ts (6 tests) 7039mspackages/git-core test:      ✓ resolves a long delta chain in one pass, whatever order the pack lists it in  3475mspackages/git-core test:      ✓ counts what each object costs in memory, not only its content  1769mspackages/git-core test:      ✓ refuses a small pack whose objects inflate past the memory budget  1746mspackages/git-core test:  Test Files  3 passed (3)packages/git-core test:       Tests  14 passed (14)packages/git-core test:    Start at  14:05:23packages/git-core test:    Duration  8.09s (transform 1.58s, setup 0ms, import 2.13s, tests 8.34s, environment 1ms)packages/git-core test: Doneapps/cli test$ vitest run --shard=1/2apps/diffinery test$ vitest run --passWithNoTests --exclude 'test/e2e/**' --shard=1/2containers/runner test$ vitest run --shard=1/2containers/runner test:  RUN  v4.1.11 /workspace/diffinery/containers/runnerapps/cli test:  RUN  v4.1.11 /workspace/diffinery/apps/cliapps/diffinery test:  RUN  v4.1.11 /workspace/diffinery/apps/diffineryapps/diffinery test: (node:408) ExperimentalWarning: SQLite is an experimental feature and might change at any timeapps/diffinery test: (Use `node --trace-warnings ...` to show where the warning was created)apps/diffinery test:  ✓ test/unit/usage.test.ts (23 tests) 148mscontainers/runner test:  ✓ test/jail.test.ts (12 tests) 241msapps/cli test:  ✓ test/login.test.ts (12 tests) 597msapps/diffinery test: (node:446) ExperimentalWarning: SQLite is an experimental feature and might change at any timeapps/diffinery test: (Use `node --trace-warnings ...` to show where the warning was created)apps/diffinery test: (node:411) ExperimentalWarning: SQLite is an experimental feature and might change at any timeapps/diffinery test: (Use `node --trace-warnings ...` to show where the warning was created)apps/diffinery test: stderr | test/unit/moderation.test.ts > suspension > refuses tokens and sessions at once, stops Actions, and unsuspending restores the tokensapps/diffinery test: mail queue not bound; dropping 1 email(s)apps/diffinery test: stderr | test/unit/moderation.test.ts > suspension > refuses tokens and sessions at once, stops Actions, and unsuspending restores the tokensapps/diffinery test: mail queue not bound; dropping 1 email(s)apps/diffinery test: stderr | test/unit/suppression.test.ts > Email Sending's answer to a send > puts a refused recipient on the list (source send) and audits it; temporary failures change nothingapps/diffinery test: email failed test Ann@Example.com E_RECIPIENT_SUPPRESSED: recipient is suppressedapps/diffinery test: stderr | test/unit/suppression.test.ts > Email Sending's answer to a send > puts a refused recipient on the list (source send) and audits it; temporary failures change nothingapps/diffinery test: email failed test bob@example.com E_DAILY_LIMIT_EXCEEDED: nopeapps/diffinery test:  ✓ test/unit/moderation.test.ts (9 tests) 376msapps/diffinery test:  ✓ test/unit/suppression.test.ts (11 tests) 380msapps/cli test:  ✓ test/pr.test.ts (18 tests) 1559msapps/cli test:      ✓ pr view, checks, diff, comment, review, ready and merge default to the current branch's pull request  354msapps/cli test:      ✓ pr checks --watch waits for the first check right after a push, and gives up after 2 minutes  492mscontainers/runner test:  ✓ test/relay.test.ts (4 tests) 1220mscontainers/runner test:      ✓ splits a single-PUT upload (containerd) into PATCH chunks under the limit  390mscontainers/runner test:      ✓ answers a streamed PATCH (docker) like the registry would, then completes with an empty PUT  689msapps/diffinery test: (node:750) ExperimentalWarning: SQLite is an experimental feature and might change at any timeapps/diffinery test: (Use `node --trace-warnings ...` to show where the warning was created)apps/cli test:  ✓ test/migrate.test.ts (4 tests) 1869msapps/cli test:      ✓ creates the repo, pushes branches and tags, and copies issues, PRs, variables and secret names  704msapps/cli test:      ✓ repo clone authenticates for that command only  563msapps/cli test:      ✓ --private and --to override the target  427msapps/cli test:  ✓ test/misc.test.ts (9 tests) 480msapps/cli test:  Test Files  4 passed (4)apps/cli test:       Tests  43 passed (43)apps/cli test:    Start at  14:05:32apps/cli test:    Duration  3.54s (transform 2.28s, setup 0ms, import 4.03s, tests 4.50s, environment 1ms)apps/diffinery test:  ✓ test/unit/review.test.ts (19 tests) 108msapps/cli test: Doneapps/diffinery test:  ✓ test/unit/runner-sizes.test.ts (16 tests) 601mscontainers/runner test:  ✓ test/runtime.test.ts (11 tests) 1665mscontainers/runner test:      ✓ uploads large files as blocks, small ones in one request, and downloads them back  1341msapps/diffinery test:  ✓ test/unit/job-permissions.test.ts (8 tests) 38msapps/diffinery test:  ✓ test/unit/auto-merge.test.ts (12 tests) 560msapps/diffinery test: (node:1038) ExperimentalWarning: SQLite is an experimental feature and might change at any timeapps/diffinery test: (Use `node --trace-warnings ...` to show where the warning was created)apps/diffinery test: stderr | test/unit/killswitch.test.ts > kill switches > counts repositories that couldn't be stopped, and needs a reasonapps/diffinery test: kill switch: stopping work in repository broken failed Error: goneapps/diffinery test:     at Object.stopActions (/workspace/diffinery/apps/diffinery/test/unit/killswitch.test.ts:24:36)apps/diffinery test:     at worker (/workspace/diffinery/apps/diffinery/src/lib/killswitch.ts:155:63)apps/diffinery test:     at Function.from (<anonymous>)apps/diffinery test:     at stopIn (/workspace/diffinery/apps/diffinery/src/lib/killswitch.ts:166:27)apps/diffinery test:     at changePause (/workspace/diffinery/apps/diffinery/src/lib/killswitch.ts:225:21)apps/diffinery test:     at process.processTicksAndRejections (node:internal/process/task_queues:105:5)apps/diffinery test:     at /workspace/diffinery/apps/diffinery/test/unit/killswitch.test.ts:123:12apps/diffinery test:     at async file:///workspace/diffinery/node_modules/.pnpm/@vitest+runner@4.1.11/node_modules/@vitest/runner/dist/chunk-artifact.js:1903:20apps/diffinery test:  ✓ test/unit/killswitch.test.ts (5 tests) 180msapps/diffinery test: stderr | test/unit/rate-limit.test.ts > rate limit checks > lets requests through when no limiter is configured or the limiter failsapps/diffinery test: rate limiter failed RL_ANON Error: downapps/diffinery test:     at Object.limit (/workspace/diffinery/apps/diffinery/test/unit/rate-limit.test.ts:89:67)apps/diffinery test:     at overLimit (/workspace/diffinery/apps/diffinery/src/lib/rate-limit.ts:71:22)apps/diffinery test:     at /workspace/diffinery/apps/diffinery/test/unit/rate-limit.test.ts:90:18apps/diffinery test:     at process.processTicksAndRejections (node:internal/process/task_queues:105:5)apps/diffinery test:  ✓ test/unit/today.test.ts (10 tests) 32msapps/diffinery test:  ✓ test/unit/coordinator.test.ts (8 tests) 13msapps/diffinery test:  ✓ test/unit/secret-scan.test.ts (7 tests) 1135msapps/diffinery test:      ✓ scans large blobs from their compressed bytes, slice by slice, with the same rules  359msapps/diffinery test:      ✓ scans a large file in slices, never as one string, with the same results  761mscontainers/runner test:  ✓ test/import.test.ts (7 tests) 6407mscontainers/runner test:      ✓ pushes history in chunks under a size limit the server enforces, then every ref, and cleans up  3695mscontainers/runner test:      ✓ pushes every version of a large file first and whole, so the server never rebuilds one from a delta  2187mscontainers/runner test:      ✓ splits a refused batch of a large commit's files again, rather than retrying it whole  509msapps/diffinery test:  ✓ test/unit/job-graph.test.ts (12 tests) 46msapps/diffinery test:  ✓ test/unit/project.test.ts (12 tests) 11msapps/diffinery test: (node:1761) ExperimentalWarning: SQLite is an experimental feature and might change at any timeapps/diffinery test: (Use `node --trace-warnings ...` to show where the warning was created)apps/diffinery test:  ✓ test/unit/job-token.test.ts (7 tests) 160msapps/diffinery test: (node:1838) ExperimentalWarning: SQLite is an experimental feature and might change at any timeapps/diffinery test: (Use `node --trace-warnings ...` to show where the warning was created)apps/diffinery test: stderr | test/unit/rate-limit.test.ts > model requests per paying person (phase 5a) > counts per person, and lets requests through without a binding or when it failsapps/diffinery test: model rate limiter failed Error: downapps/diffinery test:     at Object.limit (/workspace/diffinery/apps/diffinery/test/unit/rate-limit.test.ts:130:61)apps/diffinery test:     at modelRateLimited (/workspace/diffinery/apps/diffinery/src/lib/rate-limit.ts:90:33)apps/diffinery test:     at /workspace/diffinery/apps/diffinery/test/unit/rate-limit.test.ts:131:18apps/diffinery test:     at process.processTicksAndRejections (node:internal/process/task_queues:105:5)apps/diffinery test:     at async file:///workspace/diffinery/node_modules/.pnpm/@vitest+runner@4.1.11/node_modules/@vitest/runner/dist/chunk-artifact.js:1903:20apps/diffinery test:  ✓ test/unit/rate-limit.test.ts (10 tests) 4417msapps/diffinery test:      ✓ answers 429 with retry-after once an anonymous address is over its limit  4378msapps/diffinery test:  ✓ test/unit/visibility.test.ts (3 tests) 141msapps/diffinery test:  ✓ test/unit/reusable.test.ts (4 tests) 30msapps/diffinery test:  ❯ test/unit/markdown-safety.test.ts (28 tests | 1 failed) 998msapps/diffinery test:      ✓ renders a fence followed by spaces and a backtick in linear time 5msapps/diffinery test:      ✓ renders a heading with trailing spaces before a line separator in linear time 5msapps/diffinery test:      ✓ renders a heading with spaces before text in linear time 2msapps/diffinery test:      ✓ renders a list item with spaces before a line separator in linear time 2msapps/diffinery test:      ✓ renders a table delimiter row with spaces before text in linear time 2msapps/diffinery test:      ✓ renders a dash run with spaces before text in linear time 2msapps/diffinery test:      ✓ bounds the lookahead for unclosed links 68msapps/diffinery test:      ✓ bounds the lookahead for unclosed images 59msapps/diffinery test:      ✓ bounds the lookahead for emphasis openers that never close 24msapps/diffinery test:      ✓ bounds the lookahead for list items of emphasis openers 13msapps/diffinery test:      ✓ bounds the lookahead for many such paragraphs 60msapps/diffinery test:      ✓ formats ordinary text in full 49msapps/diffinery test:      ✓ still parses headings, fences, lists and tables 5msapps/diffinery test:      ✓ refuses paths that browsers resolve to another site 1msapps/diffinery test:      ✓ refuses Markdown links that start with a slash and a backslash in either order 0msapps/diffinery test:      × renders short lines in linear time 575msapps/diffinery test:      ✓ renders hard line breaks in linear time 19msapps/diffinery test:      ✓ renders a long tilde run in linear time 15msapps/diffinery test:      ✓ renders a long backtick run in linear time 2msapps/diffinery test:      ✓ keeps hard line breaks 0msapps/diffinery test:      ✓ hides a comment on its own lines, as GitHub does 1msapps/diffinery test:      ✓ ends a paragraph at a comment line and renders what follows the close 0msapps/diffinery test:      ✓ hides comments inside text, headings, lists, quotes and tables 1msapps/diffinery test:      ✓ keeps comments in code, escaped and unclosed ones as text 1msapps/diffinery test:      ✓ hides the rest of the document after a comment line that never closes, as GitHub does 0msapps/diffinery test:      ✓ never lets markup through around a comment 1msapps/diffinery test:      ✓ renders many comment openers in linear time 78msapps/diffinery test:      ✓ strips comments from plain text, outside code 1msapps/diffinery test:  ✓ test/unit/fsck.test.ts (16 tests) 513msapps/diffinery test:      ✓ refuses a tree too large to check, before reading its names  492msapps/diffinery test:  ✓ test/unit/required.test.ts (11 tests) 12msapps/diffinery test:  ✓ test/unit/deploy-log-notes.test.ts (2 tests) 597msapps/diffinery test:      ✓ repeats what the deploy printed, not the warnings its scripts could print  582msapps/diffinery test:  ✓ test/unit/registry-upload.test.ts (2 tests) 640msapps/diffinery test:      ✓ hash each chunk as it arrives, so the final request doesn't read the blob back  572msapps/diffinery test:  ✓ test/unit/redirects.test.ts (9 tests) 10msapps/diffinery test:  ✓ test/unit/push-retry.test.ts (4 tests) 27msapps/diffinery test:  ✓ test/unit/wait-timer.test.ts (5 tests) 7msapps/diffinery test:  ✓ test/unit/org-variables.test.ts (2 tests) 10msapps/diffinery test:  ✓ test/unit/stages.test.ts (3 tests) 12msapps/diffinery test:  ✓ test/unit/d1.test.ts (3 tests) 6msapps/diffinery test:  ✓ test/unit/environment-secrets.test.ts (4 tests) 12msapps/diffinery test:  ✓ test/unit/upload-pack.test.ts (1 test) 1049msapps/diffinery test:      ✓ sends each object as it is read, in side-band packets, never the whole pack at once  1047msapps/diffinery test:  ✓ test/unit/receive-head.test.ts (2 tests) 28msapps/diffinery test:  ✓ test/unit/job-secrets.test.ts (4 tests) 6msapps/diffinery test:  ✓ test/unit/tree-names.test.ts (5 tests) 11msapps/diffinery test: (node:1997) ExperimentalWarning: SQLite is an experimental feature and might change at any timeapps/diffinery test: (Use `node --trace-warnings ...` to show where the warning was created)apps/diffinery test:  ✓ test/unit/inflight.test.ts (1 test) 30msapps/diffinery test:  ✓ test/unit/archive-stream.test.ts (3 tests) 534msapps/diffinery test:      ✓ refuse more entries than classic zip can hold instead of writing a broken archive  355msapps/diffinery test:  ✓ test/unit/terminal-command.test.ts (1 test) 5msapps/diffinery test:  ✓ test/unit/unpack-failure.test.ts (2 tests) 5msapps/diffinery test:  ✓ test/unit/graphql.test.ts (3 tests) 12msapps/diffinery test: ⎯⎯⎯⎯⎯⎯⎯ Failed Tests 1 ⎯⎯⎯⎯⎯⎯⎯apps/diffinery test:  FAIL  test/unit/markdown-safety.test.ts > markdown over many lines > renders short lines in linear timeapps/diffinery test: AssertionError: expected 548.5127480000001 to be less than 500apps/diffinery test:  ❯ test/unit/markdown-safety.test.ts:88:30apps/diffinery test:      87|   });apps/diffinery test:      88|apps/diffinery test:      89|   it("keeps hard line breaks", () => {apps/diffinery test:        |                             ^apps/diffinery test:      90|     expect(renderMarkdown("one  \ntwo\nthree   \nfour")).toBe("<p>one<…apps/diffinery test:      91|   });apps/diffinery test: ⎯⎯⎯⎯⎯⎯⎯⎯⎯⎯⎯⎯⎯⎯⎯⎯⎯⎯⎯⎯⎯⎯⎯⎯[1/1]⎯apps/diffinery test:  Test Files  1 failed | 37 passed (38)apps/diffinery test:       Tests  1 failed | 286 passed (287)apps/diffinery test:    Start at  14:05:32apps/diffinery test:    Duration  13.31s (transform 9.90s, setup 0ms, import 15.88s, tests 12.90s, environment 6ms)apps/diffinery test: ::error file=/workspace/diffinery/apps/diffinery/test/unit/markdown-safety.test.ts,title=test/unit/markdown-safety.test.ts > markdown over many lines > renders short lines in linear time,line=88,column=30::AssertionError: expected 548.5127480000001 to be less than 500%0A ❯ test/unit/markdown-safety.test.ts:88:30%0A%0Aapps/diffinery test: Failed/workspace/diffinery/apps/diffinery: ERR_PNPM_RECURSIVE_RUN_FIRST_FAIL  @diffinery/app@0.1.0 test: `vitest run --passWithNoTests --exclude 'test/e2e/**' --shard=1/2`Exit status 1##[error]Process completed with exit code 1.
Post Run pnpm/action-setup@b906affcce14559ad1aafd4ab0e942779e9f58b10s
Pruning is unnecessary.
Post Run actions/checkout@v40s
Removing persisted credentials

Job summary

Vitest Test Report

Summary

  • Test Files: ✅ 3 passes · 3 total
  • Test Results: ✅ 102 passes · 102 total

Vitest Test Report

Summary

  • Test Files: ✅ 3 passes · 3 total
  • Test Results: ✅ 14 passes · 14 total

Vitest Test Report

Summary

  • Test Files: ✅ 4 passes · 4 total
  • Test Results: ✅ 43 passes · 43 total

Vitest Test Report

Summary

  • Test Files: ❌ 1 failure · ✅ 37 passes · 38 total
  • Test Results: ❌ 1 failure · ✅ 286 passes · 287 total