End-to-end (real histories)
took 1m 41s Raw logs
Matrix: name: real histories, shard: histories
Failed at Run the shard's tests
Process completed with exit code 1.
1..4
not ok 1 - real histories: whole projects, side by side
---
duration_ms: 87912.149772
type: 'suite'
location: '/workspace/diffinery/apps/diffinery/test/e2e/e2e.test.mjs:2921:1'
failureType: 'subtestsFailed'
error: '1 subtest failed'
code: 'ERR_TEST_FAILURE'
...
1..1
# tests 4
# suites 1
# pass 3
# fail 1
# cancelled 0
# skipped 0
# todo 0
# duration_ms 89035.799469Set up job
Diffinery runner: job e2e (End-to-end (real histories)) for codician/diffinery@0de42ca48a5fRunner: image diffinery-runner:efee6389dfc1b5bd5a743d5e, in muc01, WEUR, container 94590b27e9b874aa6ed7e63419f927ebc47d8f05d7bb5c70c349f682ea2d624aRunner size: large (4 vCPU, 12 GiB of memory, 20 GB of disk), this job uses what a smaller runner doesn't have; runs-on: diffinery-large (or -medium, -small, -tiny) sets a sizeHost: AMD EPYC (family 25, model 17), 4 vCPUs, 2550 MHzWorkspace: /workspace/diffineryHost: 0% of the vCPUs' time went to other work on the host (steal)Job completed with conclusion: failureResources: 2.0 of 4 vCPUs busy on average (3.3 at the 95th percentile), peak memory 7.6 GiB of 11.9 GiB, peak disk 3.0 GB of 19.3 GB
Run actions/checkout@v42s
##[group]Run actions/checkout@v4##[endgroup]Syncing repository: codician/diffineryFetching the repository (depth 1)remote: Enumerating objects: 762, done. Receiving objects: 0% (1/762) Receiving objects: 1% (8/762) Receiving objects: 2% (16/762) Receiving objects: 3% (23/762) Receiving objects: 4% (31/762) Receiving objects: 5% (39/762) Receiving objects: 6% (46/762) Receiving objects: 7% (54/762) Receiving objects: 8% (61/762) Receiving objects: 9% (69/762) Receiving objects: 10% (77/762) Receiving objects: 11% (84/762) Receiving objects: 12% (92/762) Receiving objects: 13% (100/762) Receiving objects: 14% (107/762) Receiving objects: 15% (115/762) Receiving objects: 16% (122/762) Receiving objects: 17% (130/762) Receiving objects: 18% (138/762) Receiving objects: 19% (145/762) Receiving objects: 20% (153/762) Receiving objects: 21% (161/762) Receiving objects: 22% (168/762) Receiving objects: 23% (176/762) Receiving objects: 24% (183/762) Receiving objects: 25% (191/762) Receiving objects: 26% (199/762) Receiving objects: 27% (206/762) Receiving objects: 28% (214/762) Receiving objects: 29% (221/762) Receiving objects: 30% (229/762) Receiving objects: 31% (237/762) Receiving objects: 32% (244/762) Receiving objects: 33% (252/762) Receiving objects: 34% (260/762) Receiving objects: 35% (267/762) Receiving objects: 36% (275/762) Receiving objects: 37% (282/762) Receiving objects: 38% (290/762) Receiving objects: 39% (298/762) Receiving objects: 40% (305/762) Receiving objects: 41% (313/762) Receiving objects: 42% (321/762) Receiving objects: 43% (328/762) Receiving objects: 44% (336/762) Receiving objects: 45% (343/762) Receiving objects: 46% (351/762) Receiving objects: 47% (359/762) Receiving objects: 48% (366/762) Receiving objects: 49% (374/762) Receiving objects: 50% (381/762) Receiving objects: 51% (389/762) Receiving objects: 52% (397/762) Receiving objects: 53% (404/762) Receiving objects: 54% (412/762) Receiving objects: 55% (420/762) Receiving objects: 56% (427/762) Receiving objects: 57% (435/762) Receiving objects: 58% (442/762) Receiving objects: 59% (450/762) Receiving objects: 60% (458/762) Receiving objects: 61% (465/762) Receiving objects: 62% (473/762) Receiving objects: 63% (481/762) Receiving objects: 64% (488/762) Receiving objects: 65% (496/762) Receiving objects: 66% (503/762) Receiving objects: 67% (511/762) Receiving objects: 68% (519/762) Receiving objects: 69% (526/762) Receiving objects: 70% (534/762) Receiving objects: 71% (542/762) Receiving objects: 72% (549/762) Receiving objects: 73% (557/762) Receiving objects: 74% (564/762) Receiving objects: 75% (572/762) Receiving objects: 76% (580/762) Receiving objects: 77% (587/762) Receiving objects: 78% (595/762) Receiving objects: 79% (602/762) Receiving objects: 80% (610/762) Receiving objects: 81% (618/762) Receiving objects: 82% (625/762) Receiving objects: 83% (633/762) Receiving objects: 84% (641/762) Receiving objects: 85% (648/762) Receiving objects: 86% (656/762) Receiving objects: 87% (663/762) Receiving objects: 88% (671/762) Receiving objects: 89% (679/762) Receiving objects: 90% (686/762) Receiving objects: 91% (694/762) Receiving objects: 92% (702/762) Receiving objects: 93% (709/762) Receiving objects: 94% (717/762) Receiving objects: 95% (724/762) Receiving objects: 96% (732/762) Receiving objects: 97% (740/762) remote: Total 762 (delta 0), reused 762 (delta 0) Receiving objects: 98% (747/762) Receiving objects: 99% (755/762) Receiving objects: 100% (762/762) Receiving objects: 100% (762/762), 3.49 MiB | 7.67 MiB/s, done.From https://diffinery.com/codician/diffinery * [new ref] 0de42ca48a5f85860f7406370aba9debef975c38 -> origin/diffinery-checkoutNote: switching to '0de42ca48a5f85860f7406370aba9debef975c38'.You are in 'detached HEAD' state. You can look around, make experimentalchanges and commit them, and you can discard any commits you make in thisstate without impacting any branches by switching back to a branch.If you want to create a new branch to retain commits you create, you maydo so (now or later) by using -c with the switch command. Example: git switch -c <new-branch-name>Or undo this operation with: git switch -Turn off this advice by setting config variable advice.detachedHead to falseHEAD is now at 0de42ca Merge 9466de61bd650dabda9e7a1639bd55e59218605c into 661e309ce989968e29581fb653414e53712919faHEAD is now at 0de42ca48a5f85860f7406370aba9debef975c38
Run pnpm/action-setup@b906affcce14559ad1aafd4ab0e942779e9f58b11s
Download action repository 'pnpm/action-setup@b906affcce14559ad1aafd4ab0e942779e9f58b1'##[group]Run pnpm/action-setup@b906affcce14559ad1aafd4ab0e942779e9f58b1with: dest: ~/setup-pnpm run_install: null cache: false cache_dependency_path: pnpm-lock.yaml package_json_file: package.json standalone: false##[endgroup]##[group]Running self-installer...Progress: resolved 1, reused 0, downloaded 0, added 0Packages: +1+Progress: resolved 1, reused 0, downloaded 1, added 1, donedependencies:+ pnpm 10.28.0 (12.14.0 is available)Done in 706ms##[endgroup]Installation Completed!
Run actions/setup-node@v44s
##[group]Run actions/setup-node@v4with: node-version: 22 cache: pnpm##[endgroup]Found in cache @ 22.22.0 (pre-installed node satisfies '22')Cache Size: ~216 MB (226493609 B)Cache restored from key: node-cache-Linux-x64-pnpm-a02ba8dce5cb7329b868883337d1a03f862819a15859861dae22d3a8b1092f41
Run pnpm install --frozen-lockfile2s
##[group]Run pnpm install --frozen-lockfile##[endgroup]Scope: all 8 workspace projectsLockfile is up to date, resolution step is skippedProgress: resolved 1, reused 0, downloaded 0, added 0Packages: +250++++++++++++++++++++++++++++++++++++++++++++++++++++++++++++++++++++++++++++++++Progress: resolved 250, reused 244, downloaded 0, added 250, done.../node_modules/workerd postinstall$ node install.js.../esbuild@0.25.11/node_modules/esbuild postinstall$ node install.js.../esbuild@0.25.12/node_modules/esbuild postinstall$ node install.js.../node_modules/workerd postinstall$ node install.js.../esbuild@0.28.1/node_modules/esbuild postinstall$ node install.js.../esbuild@0.25.12/node_modules/esbuild postinstall: Done.../esbuild@0.28.2/node_modules/esbuild postinstall$ node install.js.../esbuild@0.25.11/node_modules/esbuild postinstall: Done.../node_modules/workerd postinstall: Done.../esbuild@0.28.1/node_modules/esbuild postinstall: Done.../node_modules/workerd postinstall: Done.../esbuild@0.28.2/node_modules/esbuild postinstall: DonedevDependencies:+ turbo 2.11.7+ typescript 5.9.3Done in 1.9s using pnpm v10.28.0
Run pnpm -r --if-present build1s
##[group]Run pnpm -r --if-present build##[endgroup]Scope: 7 of 8 workspace projectsapps/cli build$ esbuild src/bin.ts --bundle --platform=node --target=node22 --format=esm --outfile=dist/diffinery.mjs "--banner:js=#!/usr/bin/env nodeimport { createRequire as __diffineryCreateRequire } from 'node:module'; const require = __diffineryCreateRequire(import.meta.url);"apps/diffinery build$ node islands/build.mjs && node scripts/build-docs.mjscontainers/runner build$ esbuild src/main.ts --bundle --platform=node --target=node22 --format=esm --outfile=dist/agent.mjs --external:bufferutil --external:utf-8-validate "--banner:js=import { createRequire as __diffineryCreateRequire } from 'node:module'; const require = __diffineryCreateRequire(import.meta.url);"apps/cli build: dist/diffinery.mjs 446.1kbapps/cli build: ⚡ Done in 45msapps/cli build: Donecontainers/runner build: dist/agent.mjs 684.1kbcontainers/runner build: ⚡ Done in 48mscontainers/runner build: Doneapps/diffinery build: islands: kumo.js 466 KB, kumo.css 149 KB, terminal.js 286 KBapps/diffinery build: docs: 73 pages (+2 generated at runtime), 10 site pages, 11 images, CLI 0.1.0 (235 KiB), editor extension 0.1.1 (20 KiB), JetBrains plugin 0.1.0 (64 KiB)apps/diffinery build: Done
Run pnpm --filter @diffinery/app exec playwright install --with-deps chromium
Run as_root() { if [ "$(id -u)" = 0 ]; then "$@"; else sudo "$@"; fi; }
Run the shard's tests1m 29s
##[group]Run # Shards of similar length; a new test file runs in "rest" unless it's added to another.core='/e2e\.test\.mjs$'agents='/(agentic|review|tasks)\.test\.mjs$'# security.test.mjs, security-*.test.mjs (security-txt's too) and status.test.mjs.security='/(security(-[a-z-]+)?|status)\.test\.mjs$'# The core file's real histories and large pushes take minutes each (jquery's alone 2 to 3 on# Diffinery's runners): two shards of their own, so no part of the file runs into node's# per-file timeout, which is the --test-timeout here.histories='^real histories:'large='^(large files|large pushes):'opts=(--test-timeout=600000)case "histories" in core) files=$(ls test/e2e/*.test.mjs | grep -E "$core"); opts+=(--test-skip-pattern="$histories" --test-skip-pattern="$large") ;; histories) files=$(ls test/e2e/*.test.mjs | grep -E "$core"); opts=(--test-timeout=900000 --test-name-pattern="$histories") ;; large) files=$(ls test/e2e/*.test.mjs | grep -E "$core"); opts+=(--test-name-pattern="$large") ;; agents) files=$(ls test/e2e/*.test.mjs | grep -E "$agents") ;; security) files=$(ls test/e2e/*.test.mjs | grep -E "$security") ;; *) files=$(ls test/e2e/*.test.mjs | grep -vE "$core|$agents|$security") ;;esacecho "$files"# Two files at a time: each starts its own local server on its own port, database and# directory, so they don't share state, and a file's server mostly keeps one core busy.node --test --test-concurrency=2 "${opts[@]}" $files##[endgroup]test/e2e/e2e.test.mjsTAP version 13# Subtest: real histories: whole projects, side by side # Subtest: real histories: jquery's whole history goes in one push and clones back intact not ok 1 - real histories: jquery's whole history goes in one push and clones back intact --- duration_ms: 43609.13983 type: 'test' location: '/workspace/diffinery/apps/diffinery/test/e2e/e2e.test.mjs:2929:5' failureType: 'testCodeFailure' error: |- git clone -q --bare http://127.0.0.1:41813/dev/jquery.git /tmp/diffinery-e2e-0nQbcz/jquery-clone exited 128 error: RPC failed; curl 7 Failed to connect to 127.0.0.1 port 41813 after 0 ms: Couldn't connect to server fatal: expected 'packfile' the Worker was at http://127.0.0.1:41813; wrangler dev now names http://127.0.0.1:41813 --- wrangler log tail --- ts:51:8) at RunnerContainer (file:///workspace/diffinery/node_modules/.pnpm/miniflare@5.20261006.1-alpha_@types+node@22.20.5/node_modules/miniflare/dist/src/workers/core/do-wrapper.worker.js:10:7) ✘ [ERROR] Uncaught Error: Containers have not been enabled for this Durable Object class. Have you correctly setup your Wrangler config? More info: https://developers.cloudflare.com/containers/get-started/#configuration ✘ [ERROR] Uncaught Error: Containers have not been enabled for this Durable Object class. Have you correctly setup your Wrangler config? More info: https://developers.cloudflare.com/containers/get-started/#configuration Error at Container (file:///workspace/diffinery/node_modules/.pnpm/@cloudflare+containers@0.3.7/node_modules/@cloudflare/containers/src/lib/container.ts:533:13) at HostedContainer (file:///workspace/diffinery/apps/diffinery/src/runner/containers.ts:19:5) at RunnerContainer (file:///workspace/diffinery/apps/diffinery/src/runner/containers.ts:51:8) at RunnerContainer (file:///workspace/diffinery/node_modules/.pnpm/miniflare@5.20261006.1-alpha_@types+node@22.20.5/node_modules/miniflare/dist/src/workers/core/do-wrapper.worker.js:10:7) ✘ [ERROR] Uncaught Error: Containers have not been enabled for this Durable Object class. Have you correctly setup your Wrangler config? More info: https://developers.cloudflare.com/containers/get-started/#configuration ✘ [ERROR] Uncaught Error: Containers have not been enabled for this Durable Object class. Have you correctly setup your Wrangler config? More info: https://developers.cloudflare.com/containers/get-started/#configuration Error at Container (file:///workspace/diffinery/node_modules/.pnpm/@cloudflare+containers@0.3.7/node_modules/@cloudflare/containers/src/lib/container.ts:533:13) at HostedContainer (file:///workspace/diffinery/apps/diffinery/src/runner/containers.ts:19:5) at RunnerContainer (file:///workspace/diffinery/apps/diffinery/src/runner/containers.ts:51:8) at RunnerContainer (file:///workspace/diffinery/node_modules/.pnpm/miniflare@5.20261006.1-alpha_@types+node@22.20.5/node_modules/miniflare/dist/src/workers/core/do-wrapper.worker.js:10:7) ✘ [ERROR] Uncaught Error: Containers have not been enabled for this Durable Object class. Have you correctly setup your Wrangler config? More info: https://developers.cloudflare.com/containers/get-started/#configuration ✘ [ERROR] Uncaught Error: Containers have not been enabled for this Durable Object class. Have you correctly setup your Wrangler config? More info: https://developers.cloudflare.com/containers/get-started/#configuration Error at Container (file:///workspace/diffinery/node_modules/.pnpm/@cloudflare+containers@0.3.7/node_modules/@cloudflare/containers/src/lib/container.ts:533:13) at HostedContainer (file:///workspace/diffinery/apps/diffinery/src/runner/containers.ts:19:5) at RunnerContainer (file:///workspace/diffinery/apps/diffinery/src/runner/containers.ts:51:8) at RunnerContainer (file:///workspace/diffinery/node_modules/.pnpm/miniflare@5.20261006.1-alpha_@types+node@22.20.5/node_modules/miniflare/dist/src/workers/core/do-wrapper.worker.js:10:7) ✘ [ERROR] Uncaught Error: Containers have not been enabled for this Durable Object class. Have you correctly setup your Wrangler config? More info: https://developers.cloudflare.com/containers/get-started/#configuration ✘ [ERROR] Uncaught Error: Containers have not been enabled for this Durable Object class. Have you correctly setup your Wrangler config? More info: https://developers.cloudflare.com/containers/get-started/#configuration code: 'ERR_TEST_FAILURE' stack: |- ChildProcess.<anonymous> (file:///workspace/diffinery/apps/diffinery/test/e2e/e2e.test.mjs:2853:26) ChildProcess.emit (node:events:519:28) maybeClose (node:internal/child_process:1101:16) Socket.<anonymous> (node:internal/child_process:456:11) Socket.emit (node:events:519:28) Pipe.<anonymous> (node:net:346:12) ... # Subtest: real histories: tornado's whole history goes in one push and clones back intact ok 2 - real histories: tornado's whole history goes in one push and clones back intact --- duration_ms: 35643.636831 type: 'test' ... # Subtest: real histories: flask's whole history goes in one push and clones back intact ok 3 - real histories: flask's whole history goes in one push and clones back intact --- duration_ms: 29254.735295 type: 'test' ... # Subtest: real histories: a 2.6 MB lockfile's 60 versions, a chain of deltas, go in one small push ok 4 - real histories: a 2.6 MB lockfile's 60 versions, a chain of deltas, go in one small push --- duration_ms: 31321.167287 type: 'test' ... 1..4not ok 1 - real histories: whole projects, side by side --- duration_ms: 87912.149772 type: 'suite' location: '/workspace/diffinery/apps/diffinery/test/e2e/e2e.test.mjs:2921:1' failureType: 'subtestsFailed' error: '1 subtest failed' code: 'ERR_TEST_FAILURE' ...1..1# tests 4# suites 1# pass 3# fail 1# cancelled 0# skipped 0# todo 0# duration_ms 89035.799469##[error]Process completed with exit code 1.
Post Run pnpm/action-setup@b906affcce14559ad1aafd4ab0e942779e9f58b10s
Pruning is unnecessary.Post Run actions/checkout@v40s
Removing persisted credentials