Diffinery

codician/diffinerypublic

Open-source, agent-first GitHub and GitHub Actions alternative that runs on your own Cloudflare account: git hosting, pull requests, code review and drop-in GitHub Actions YAML on Workers, Durable Objects, R2 and Containers.

Unit tests (2/2)

took 56s Raw logs

Matrix: shard: 2

Failed at Unit tests
Process completed with exit code 1.

apps/diffinery test:     false,
apps/diffinery test:   ]
apps/diffinery test:  ❯ test/unit/actions-runtime.test.ts:1089:28
apps/diffinery test:     1087|     expect(job("b").status).toBe("in_progress");
apps/diffinery test:     1088|     await actions.enforceJobDeadlines(deadline);
apps/diffinery test:     1089|     expect(stopped.at(-1)).toEqual(["job-b", false]);
apps/diffinery test:        |                            ^
apps/diffinery test:     1090|     expect(job("b").conclusion).toBe("cancelled");
apps/diffinery test:     1091|     expect(JSON.parse(job("b").failure!).message).toBe(`Cancelled by o…
apps/diffinery test: ⎯⎯⎯⎯⎯⎯⎯⎯⎯⎯⎯⎯⎯⎯⎯⎯⎯⎯⎯⎯⎯⎯⎯⎯[1/1]⎯
apps/diffinery test:  Test Files  1 failed | 39 passed (40)
apps/diffinery test:       Tests  1 failed | 669 passed (670)
apps/diffinery test:    Start at  14:09:08
apps/diffinery test:    Duration  17.94s (transform 8.17s, setup 0ms, import 16.85s, tests 30.15s, environment 4ms)
apps/diffinery test: ::error file=/workspace/diffinery/apps/diffinery/test/unit/actions-runtime.test.ts,title=test/unit/actions-runtime.test.ts > hosted runner slots > cancelling a run lets running hosted jobs run their steps that run after a cancel%2C and ends them after CANCEL_STOP_MS,line=1089,column=28::AssertionError: expected [ 'job-w', false ] to deeply equal [ 'job-b', false ]%0A%0A- Expected%0A+ Received%0A%0A  [%0A-   "job-b",%0A+   "job-w",%0A    false,%0A  ]%0A%0A ❯ test/unit/actions-runtime.test.ts:1089:28%0A%0A
apps/diffinery test: Failed
/workspace/diffinery/apps/diffinery:
 ERR_PNPM_RECURSIVE_RUN_FIRST_FAIL  @diffinery/app@0.1.0 test: `vitest run --passWithNoTests --exclude 'test/e2e/**' --shard=2/2`
Exit status 1
Set up job
Diffinery runner: job test (Unit tests (2/2)) for codician/diffinery@1d10bcf54df8Runner: image diffinery-runner:4d3bf17f06575e64ab4155b3, in cdg15, WEUR, container bf996d69198489a04967ea3db2643e29c3d3c0b5647682001c5c27f4d005c51cRunner size: large (4 vCPU, 12 GiB of memory, 20 GB of disk), this job uses what a smaller runner doesn't have; runs-on: diffinery-large (or -medium, -small, -tiny) sets a sizeHost: AMD EPYC (family 25, model 17), 4 vCPUs, 2550 MHzWorkspace: /workspace/diffineryHost: 0% of the vCPUs' time went to other work on the host (steal)Job completed with conclusion: failureResources: 2.1 of 4 vCPUs busy on average (3.8 at the 95th percentile), peak memory 2.3 GiB of 11.9 GiB, peak disk 2.2 GB of 19.2 GB
Run actions/checkout@v42s
##[group]Run actions/checkout@v4##[endgroup]Syncing repository: codician/diffineryFetching the repository (depth 1)remote: Enumerating objects: 770, done.        Receiving objects:   0% (1/770)
Receiving objects:   1% (8/770)
Receiving objects:   2% (16/770)
Receiving objects:   3% (24/770)
Receiving objects:   4% (31/770)
Receiving objects:   5% (39/770)
Receiving objects:   6% (47/770)
Receiving objects:   7% (54/770)
Receiving objects:   8% (62/770)
Receiving objects:   9% (70/770)
Receiving objects:  10% (77/770)
Receiving objects:  11% (85/770)
Receiving objects:  12% (93/770)
Receiving objects:  13% (101/770)
Receiving objects:  14% (108/770)
Receiving objects:  15% (116/770)
Receiving objects:  16% (124/770)
Receiving objects:  17% (131/770)
Receiving objects:  18% (139/770)
Receiving objects:  19% (147/770)
Receiving objects:  20% (154/770)
Receiving objects:  21% (162/770)
Receiving objects:  22% (170/770)
Receiving objects:  23% (178/770)
Receiving objects:  24% (185/770)
Receiving objects:  25% (193/770)
Receiving objects:  26% (201/770)
Receiving objects:  27% (208/770)
Receiving objects:  28% (216/770)
Receiving objects:  29% (224/770)
Receiving objects:  30% (231/770)
Receiving objects:  31% (239/770)
Receiving objects:  32% (247/770)
Receiving objects:  33% (255/770)
Receiving objects:  34% (262/770)
Receiving objects:  35% (270/770)
Receiving objects:  36% (278/770)
Receiving objects:  37% (285/770)
Receiving objects:  38% (293/770)
Receiving objects:  39% (301/770)
Receiving objects:  40% (308/770)
Receiving objects:  41% (316/770)
Receiving objects:  42% (324/770)
Receiving objects:  43% (332/770)
Receiving objects:  44% (339/770)
Receiving objects:  45% (347/770)
Receiving objects:  46% (355/770)
Receiving objects:  47% (362/770)
Receiving objects:  48% (370/770)
Receiving objects:  49% (378/770)
Receiving objects:  50% (385/770)
Receiving objects:  51% (393/770)
Receiving objects:  52% (401/770)
Receiving objects:  53% (409/770)
Receiving objects:  54% (416/770)
Receiving objects:  55% (424/770)
Receiving objects:  56% (432/770)
Receiving objects:  57% (439/770)
Receiving objects:  58% (447/770)
Receiving objects:  59% (455/770)
Receiving objects:  60% (462/770)
Receiving objects:  61% (470/770)
Receiving objects:  62% (478/770)
Receiving objects:  63% (486/770)
Receiving objects:  64% (493/770)
Receiving objects:  65% (501/770)
Receiving objects:  66% (509/770)
Receiving objects:  67% (516/770)
Receiving objects:  68% (524/770)
Receiving objects:  69% (532/770)
Receiving objects:  70% (539/770)
Receiving objects:  71% (547/770)
Receiving objects:  72% (555/770)
Receiving objects:  73% (563/770)
Receiving objects:  74% (570/770)
Receiving objects:  75% (578/770)
Receiving objects:  76% (586/770)
Receiving objects:  77% (593/770)
Receiving objects:  78% (601/770)
Receiving objects:  79% (609/770)
Receiving objects:  80% (616/770)
Receiving objects:  81% (624/770)
Receiving objects:  82% (632/770)
Receiving objects:  83% (640/770)
Receiving objects:  84% (647/770)
Receiving objects:  85% (655/770)
Receiving objects:  86% (663/770)
Receiving objects:  87% (670/770)
Receiving objects:  88% (678/770)
Receiving objects:  89% (686/770)
Receiving objects:  90% (693/770)
Receiving objects:  91% (701/770)
Receiving objects:  92% (709/770)
Receiving objects:  93% (717/770)
Receiving objects:  94% (724/770), 3.42 MiB | 6.83 MiB/s
Receiving objects:  95% (732/770), 3.42 MiB | 6.83 MiB/s
Receiving objects:  96% (740/770), 3.42 MiB | 6.83 MiB/s
Receiving objects:  97% (747/770), 3.42 MiB | 6.83 MiB/s
remote: Total 770 (delta 0), reused 770 (delta 0)        Receiving objects:  98% (755/770), 3.42 MiB | 6.83 MiB/s
Receiving objects:  99% (763/770), 3.42 MiB | 6.83 MiB/s
Receiving objects: 100% (770/770), 3.42 MiB | 6.83 MiB/s
Receiving objects: 100% (770/770), 3.53 MiB | 7.02 MiB/s, done.From https://diffinery.com/codician/diffinery * [new ref]         1d10bcf54df8a53b04114256cd7ce04be30cf401 -> origin/mainSwitched to a new branch 'main'HEAD is now at 1d10bcf54df8a53b04114256cd7ce04be30cf401
Run pnpm/action-setup@b906affcce14559ad1aafd4ab0e942779e9f58b12s
Download action repository 'pnpm/action-setup@b906affcce14559ad1aafd4ab0e942779e9f58b1'##[group]Run pnpm/action-setup@b906affcce14559ad1aafd4ab0e942779e9f58b1with:  dest: ~/setup-pnpm  run_install: null  cache: false  cache_dependency_path: pnpm-lock.yaml  package_json_file: package.json  standalone: false##[endgroup]##[group]Running self-installer...Progress: resolved 1, reused 0, downloaded 0, added 0Packages: +1+Progress: resolved 1, reused 0, downloaded 1, added 1, donedependencies:+ pnpm 10.28.0 (12.15.0 is available)Done in 1.1s##[endgroup]Installation Completed!
Run actions/setup-node@v45s
##[group]Run actions/setup-node@v4with:  node-version: 22  cache: pnpm##[endgroup]Found in cache @ 22.22.0 (pre-installed node satisfies '22')Cache Size: ~216 MB (226493609 B)Cache restored from key: node-cache-Linux-x64-pnpm-a02ba8dce5cb7329b868883337d1a03f862819a15859861dae22d3a8b1092f41
Run pnpm install --frozen-lockfile3s
##[group]Run pnpm install --frozen-lockfile##[endgroup]Scope: all 8 workspace projectsLockfile is up to date, resolution step is skippedProgress: resolved 1, reused 0, downloaded 0, added 0Packages: +250++++++++++++++++++++++++++++++++++++++++++++++++++++++++++++++++++++++++++++++++Progress: resolved 250, reused 244, downloaded 0, added 234Progress: resolved 250, reused 244, downloaded 0, added 250, done.../node_modules/workerd postinstall$ node install.js.../esbuild@0.25.12/node_modules/esbuild postinstall$ node install.js.../esbuild@0.28.1/node_modules/esbuild postinstall$ node install.js.../node_modules/workerd postinstall$ node install.js.../esbuild@0.25.11/node_modules/esbuild postinstall$ node install.js.../esbuild@0.25.11/node_modules/esbuild postinstall: Done.../esbuild@0.25.12/node_modules/esbuild postinstall: Done.../node_modules/workerd postinstall: Done.../esbuild@0.28.1/node_modules/esbuild postinstall: Done.../esbuild@0.28.2/node_modules/esbuild postinstall$ node install.js.../esbuild@0.28.2/node_modules/esbuild postinstall: Done.../node_modules/workerd postinstall: DonedevDependencies:+ turbo 2.11.7+ typescript 5.9.3Done in 2.9s using pnpm v10.28.0
Build2s
##[group]Run pnpm -r --if-present build##[endgroup]Scope: 7 of 8 workspace projectsapps/cli build$ esbuild src/bin.ts --bundle --platform=node --target=node22 --format=esm --outfile=dist/diffinery.mjs "--banner:js=#!/usr/bin/env nodeimport { createRequire as __diffineryCreateRequire } from 'node:module'; const require = __diffineryCreateRequire(import.meta.url);"apps/diffinery build$ node islands/build.mjs && node scripts/build-docs.mjscontainers/runner build$ esbuild src/main.ts --bundle --platform=node --target=node22 --format=esm --outfile=dist/agent.mjs --external:bufferutil --external:utf-8-validate "--banner:js=import { createRequire as __diffineryCreateRequire } from 'node:module'; const require = __diffineryCreateRequire(import.meta.url);"apps/cli build:   dist/diffinery.mjs  460.5kbapps/cli build: ⚡ Done in 48msapps/cli build: Donecontainers/runner build:   dist/agent.mjs  684.1kbcontainers/runner build: ⚡ Done in 76mscontainers/runner build: Doneapps/diffinery build: islands: kumo.js 466 KB, kumo.css 149 KB, terminal.js 286 KBapps/diffinery build: docs: 74 pages (+2 generated at runtime), 10 site pages, 11 images, CLI 0.1.0 (245 KiB), editor extension 0.1.1 (20 KiB), JetBrains plugin 0.1.0 (64 KiB)apps/diffinery build: Done
Unit tests41s
##[group]Run pnpm -r --if-present run test --shard=2/2##[endgroup]Scope: 7 of 8 workspace projectsapps/vscode test$ vitest run --shard=2/2packages/git-core test$ vitest run --shard=2/2packages/workflow-yaml test$ vitest run --shard=2/2apps/vscode test: (!) Your Vite config uses features that are unsupported by `configLoader: 'native'`, which is planned to become the default in a future major version of Vite:apps/vscode test:   - ESM syntax in a file loaded as CommonJS (vitest.config.ts:1:1). Use a `.mjs` extension or set `"type": "module"` in the closest package.jsonapps/vscode test:   - ESM syntax in a file loaded as CommonJS (../../vitest.shared.ts:10:1). Use a `.mjs` extension or set `"type": "module"` in the closest package.jsonapps/vscode test: Set `VITE_CONFIG_NATIVE_IGNORE_WARNING=true` to suppress this warning.packages/git-core test: (!) Your Vite config uses features that are unsupported by `configLoader: 'native'`, which is planned to become the default in a future major version of Vite:packages/git-core test:   - import "../../vitest.shared" without a file extension (vitest.config.ts:2:26). Add the file extensionpackages/git-core test:   - ESM syntax in a file loaded as CommonJS (../../vitest.shared.ts:10:1). Use a `.mjs` extension or set `"type": "module"` in the closest package.jsonpackages/git-core test: Set `VITE_CONFIG_NATIVE_IGNORE_WARNING=true` to suppress this warning.packages/workflow-yaml test: (!) Your Vite config uses features that are unsupported by `configLoader: 'native'`, which is planned to become the default in a future major version of Vite:packages/workflow-yaml test:   - import "../../vitest.shared" without a file extension (vitest.config.ts:2:26). Add the file extensionpackages/workflow-yaml test:   - ESM syntax in a file loaded as CommonJS (../../vitest.shared.ts:10:1). Use a `.mjs` extension or set `"type": "module"` in the closest package.jsonpackages/workflow-yaml test: Set `VITE_CONFIG_NATIVE_IGNORE_WARNING=true` to suppress this warning.apps/vscode test:  RUN  v4.1.11 /workspace/diffinery/apps/vscodepackages/git-core test:  RUN  v4.1.11 /workspace/diffinery/packages/git-corepackages/workflow-yaml test:  RUN  v4.1.11 /workspace/diffinery/packages/workflow-yamlapps/vscode test:  ✓ test/signin.test.ts (4 tests) 9msapps/vscode test:  Test Files  1 passed (1)apps/vscode test:       Tests  4 passed (4)apps/vscode test:    Start at  14:08:46apps/vscode test:    Duration  323ms (transform 57ms, setup 0ms, import 78ms, tests 9ms, environment 0ms)apps/vscode test: Donepackages/workflow-yaml test:  ✓ test/matrix.test.ts (17 tests) 18mspackages/workflow-yaml test:  ✓ test/filters.test.ts (78 tests) 57mspackages/workflow-yaml test:  Test Files  2 passed (2)packages/workflow-yaml test:       Tests  95 passed (95)packages/workflow-yaml test:    Start at  14:08:46packages/workflow-yaml test:    Duration  683ms (transform 553ms, setup 0ms, import 765ms, tests 75ms, environment 0ms)packages/workflow-yaml test: Donepackages/git-core test:  ✓ test/bombs.test.ts (4 tests) 390mspackages/git-core test:  ✓ test/pack.test.ts (9 tests) 2565mspackages/git-core test:      ✓ parses a pack over 16 MB holding one large blob  1922mspackages/git-core test:  ✓ test/pack-unpack-stream.test.ts (17 tests) 20154mspackages/git-core test:      ✓ finds the same objects, with the same contents, as parsePack  343mspackages/git-core test:      ✓ reads the pack in ranges and keeps the #125 budget  569mspackages/git-core test:      ✓ refuses a corrupt pack  342mspackages/git-core test:      ✓ resolves a long delta chain in one pass  5333mspackages/git-core test:      ✓ charges every object it holds, so one huge object is refused rather than run the isolate out of memory  344mspackages/git-core test:      ✓ reads each entry's own range again, keeps small ones from the first pass, and counts its reads  428mspackages/git-core test:      ✓ rebuilds the deltas for storing with exactly the work that already passed  496mspackages/git-core test:      ✓ hashes and compresses a large object without a second copy of it  2080mspackages/git-core test:      ✓ rebuilds a long history of one large file holding two versions at a time  5041mspackages/git-core test:      ✓ frees a chain's first version once the next is rebuilt from it  3159mspackages/git-core test:      ✓ measures what a large rebuilt delta compresses to, for counting and storing it  1419mspackages/git-core test:  Test Files  3 passed (3)packages/git-core test:       Tests  30 passed (30)packages/git-core test:    Start at  14:08:46packages/git-core test:    Duration  21.53s (transform 913ms, setup 0ms, import 1.96s, tests 23.11s, environment 0ms)packages/git-core test: Doneapps/cli test$ vitest run --shard=2/2apps/diffinery test$ vitest run --passWithNoTests --exclude 'test/e2e/**' --shard=2/2containers/runner test$ vitest run --shard=2/2apps/diffinery test: (!) Your Vite config uses features that are unsupported by `configLoader: 'native'`, which is planned to become the default in a future major version of Vite:apps/diffinery test:   - import "../../vitest.shared" without a file extension (vitest.config.ts:3:26). Add the file extensionapps/diffinery test:   - ESM syntax in a file loaded as CommonJS (../../vitest.shared.ts:10:1). Use a `.mjs` extension or set `"type": "module"` in the closest package.jsonapps/diffinery test: Set `VITE_CONFIG_NATIVE_IGNORE_WARNING=true` to suppress this warning.apps/cli test: (!) Your Vite config uses features that are unsupported by `configLoader: 'native'`, which is planned to become the default in a future major version of Vite:apps/cli test:   - import "../../vitest.shared" without a file extension (vitest.config.ts:2:26). Add the file extensionapps/cli test:   - ESM syntax in a file loaded as CommonJS (../../vitest.shared.ts:10:1). Use a `.mjs` extension or set `"type": "module"` in the closest package.jsonapps/cli test: Set `VITE_CONFIG_NATIVE_IGNORE_WARNING=true` to suppress this warning.containers/runner test: (!) Your Vite config uses features that are unsupported by `configLoader: 'native'`, which is planned to become the default in a future major version of Vite:containers/runner test:   - import "../../vitest.shared" without a file extension (vitest.config.ts:2:26). Add the file extensioncontainers/runner test:   - ESM syntax in a file loaded as CommonJS (../../vitest.shared.ts:10:1). Use a `.mjs` extension or set `"type": "module"` in the closest package.jsoncontainers/runner test: Set `VITE_CONFIG_NATIVE_IGNORE_WARNING=true` to suppress this warning.apps/diffinery test:  RUN  v4.1.11 /workspace/diffinery/apps/diffineryapps/cli test:  RUN  v4.1.11 /workspace/diffinery/apps/clicontainers/runner test:  RUN  v4.1.11 /workspace/diffinery/containers/runnerapps/diffinery test: (node:602) ExperimentalWarning: SQLite is an experimental feature and might change at any timeapps/diffinery test: (Use `node --trace-warnings ...` to show where the warning was created)apps/diffinery test: (node:599) ExperimentalWarning: SQLite is an experimental feature and might change at any timeapps/diffinery test: (Use `node --trace-warnings ...` to show where the warning was created)containers/runner test: [sandbox] Cloning into '/tmp/sandbox-xZTuLd/repo'...apps/cli test:  ✓ test/credential.test.ts (8 tests) 152msapps/cli test:  ✓ test/config.test.ts (12 tests) 279msapps/cli test:  ✓ test/runner.test.ts (8 tests) 522msapps/diffinery test: (node:612) ExperimentalWarning: SQLite is an experimental feature and might change at any timeapps/diffinery test: (Use `node --trace-warnings ...` to show where the warning was created)apps/cli test:  ✓ test/workflow.test.ts (6 tests) 91msapps/cli test:  Test Files  4 passed (4)apps/cli test:       Tests  34 passed (34)apps/cli test:    Start at  14:09:08apps/cli test:    Duration  2.01s (transform 1.62s, setup 0ms, import 2.86s, tests 1.04s, environment 0ms)apps/cli test: Doneapps/diffinery test:  ✓ test/unit/imports.test.ts (37 tests) 233msapps/diffinery test:  ✓ test/unit/early-access.test.ts (17 tests) 577mscontainers/runner test: [sandbox] Cloning into '/tmp/pool-8KCWcS/sb1/repo'...apps/diffinery test: (node:905) ExperimentalWarning: SQLite is an experimental feature and might change at any timeapps/diffinery test: (Use `node --trace-warnings ...` to show where the warning was created)containers/runner test:  ✓ test/runtime.test.ts (12 tests) 1708mscontainers/runner test:      ✓ uploads large files as blocks, small ones in one request, and downloads them back  1078mscontainers/runner test:      ✓ downloads in ranges, several at once, retrying a range on its own  343msapps/diffinery test:  ✓ test/unit/org-policy.test.ts (13 tests) 314mscontainers/runner test: [sandbox] Cloning into '/tmp/pool-QkTYdI/sb2/repo'...containers/runner test:  ✓ test/sandbox.test.ts (10 tests) 2432mscontainers/runner test:      ✓ times out long commands  335mscontainers/runner test:      ✓ runs background processes: env, secret env masked, output from offsets, exit codes  378mscontainers/runner test:      ✓ runs one shell on a PTY in the checkout, resizes it, and redraws it for the next tab  729msapps/diffinery test:  ✓ test/unit/master-key.test.ts (19 tests) 88msapps/diffinery test:  ✓ test/unit/tasks.test.ts (20 tests) 50mscontainers/runner test:  ✓ test/jail-sni.test.ts (4 tests) 551mscontainers/runner test:        ✓ opens the tunnel when the ClientHello asks for the CONNECT host  527mscontainers/runner test:  ✓ test/unit.test.ts (14 tests) 1526mscontainers/runner test:      ✓ log batcher retries and never drops lines  1502mscontainers/runner test:  ✓ test/usage.test.ts (4 tests) 194msapps/diffinery test: (node:1102) ExperimentalWarning: SQLite is an experimental feature and might change at any timeapps/diffinery test: (Use `node --trace-warnings ...` to show where the warning was created)apps/diffinery test:  ✓ test/unit/status.test.ts (13 tests) 107msapps/diffinery test: (node:893) ExperimentalWarning: SQLite is an experimental feature and might change at any timeapps/diffinery test: (Use `node --trace-warnings ...` to show where the warning was created)apps/diffinery test: stderr | test/unit/cli-login.test.ts > CLI sign-in in the browser > trades the code and verifier for a CLI token once, with the scope the person choseapps/diffinery test: mail queue not bound; dropping 1 email(s)apps/diffinery test: stderr | test/unit/cli-login.test.ts > CLI sign-in with a device code > waits for the person, then hands the CLI its token onceapps/diffinery test: mail queue not bound; dropping 1 email(s)apps/diffinery test: stderr | test/unit/cli-login.test.ts > diffinery logout > revokes a CLI token with itself, and leaves other tokens aloneapps/diffinery test: mail queue not bound; dropping 1 email(s)apps/diffinery test:  ✓ test/unit/cli-login.test.ts (15 tests) 462msapps/diffinery test: stderr | test/unit/actions-runtime.test.ts > hosted runner slots > a repository runs at most SHARE hosted jobs at once; the rest wait their turnapps/diffinery test: kill switch check failed TypeError: Cannot read properties of undefined (reading 'prepare')apps/diffinery test:     at killSwitches (/workspace/diffinery/apps/diffinery/src/lib/killswitch.ts:46:26)apps/diffinery test:     at Actions.blocked (/workspace/diffinery/apps/diffinery/src/repo/actions.ts:2932:30)apps/diffinery test:     at Actions.admit (/workspace/diffinery/apps/diffinery/src/repo/actions.ts:1284:30)apps/diffinery test:     at Actions.launch (/workspace/diffinery/apps/diffinery/src/repo/actions.ts:1238:34)apps/diffinery test:     at launch (/workspace/diffinery/apps/diffinery/test/unit/actions-runtime.test.ts:718:98)apps/diffinery test:     at /workspace/diffinery/apps/diffinery/test/unit/actions-runtime.test.ts:719:47apps/diffinery test:     at file:///workspace/diffinery/node_modules/.pnpm/@vitest+runner@4.1.11/node_modules/@vitest/runner/dist/chunk-artifact.js:302:11apps/diffinery test:     at file:///workspace/diffinery/node_modules/.pnpm/@vitest+runner@4.1.11/node_modules/@vitest/runner/dist/chunk-artifact.js:1903:26apps/diffinery test:     at file:///workspace/diffinery/node_modules/.pnpm/@vitest+runner@4.1.11/node_modules/@vitest/runner/dist/chunk-artifact.js:2326:20apps/diffinery test:     at new Promise (<anonymous>)apps/diffinery test: stderr | test/unit/actions-runtime.test.ts > hosted runner slots > a repository runs at most SHARE hosted jobs at once; the rest wait their turnapps/diffinery test: quota check failed TypeError: Cannot read properties of undefined (reading 'prepare')apps/diffinery test:     at adminRun (/workspace/diffinery/apps/diffinery/src/lib/quotas.ts:50:26)apps/diffinery test:     at quotasFor (/workspace/diffinery/apps/diffinery/src/lib/quotas.ts:60:13)apps/diffinery test:     at mayStart (/workspace/diffinery/apps/diffinery/src/lib/quotas.ts:191:19)apps/diffinery test:     at Actions.admit (/workspace/diffinery/apps/diffinery/src/repo/actions.ts:1307:25)apps/diffinery test:     at Actions.launch (/workspace/diffinery/apps/diffinery/src/repo/actions.ts:1238:23)apps/diffinery test:     at /workspace/diffinery/apps/diffinery/test/unit/actions-runtime.test.ts:719:41apps/diffinery test:     at async file:///workspace/diffinery/node_modules/.pnpm/@vitest+runner@4.1.11/node_modules/@vitest/runner/dist/chunk-artifact.js:1903:20apps/diffinery test: stderr | test/unit/actions-runtime.test.ts > hosted runner slots > a repository runs at most SHARE hosted jobs at once; the rest wait their turnapps/diffinery test: compute usage failed TypeError: Cannot read properties of undefined (reading 'prepare')apps/diffinery test:     at startCompute (/workspace/diffinery/apps/diffinery/src/lib/quotas.ts:213:16)apps/diffinery test:     at Actions.admit (/workspace/diffinery/apps/diffinery/src/repo/actions.ts:1322:11)apps/diffinery test:     at Actions.launch (/workspace/diffinery/apps/diffinery/src/repo/actions.ts:1238:23)apps/diffinery test:     at /workspace/diffinery/apps/diffinery/test/unit/actions-runtime.test.ts:719:41apps/diffinery test:     at async file:///workspace/diffinery/node_modules/.pnpm/@vitest+runner@4.1.11/node_modules/@vitest/runner/dist/chunk-artifact.js:1903:20apps/diffinery test: stderr | test/unit/actions-runtime.test.ts > hosted runner slots > a repository runs at most SHARE hosted jobs at once; the rest wait their turnapps/diffinery test: kill switch check failed TypeError: Cannot read properties of undefined (reading 'prepare')apps/diffinery test:     at killSwitches (/workspace/diffinery/apps/diffinery/src/lib/killswitch.ts:46:26)apps/diffinery test:     at Actions.blocked (/workspace/diffinery/apps/diffinery/src/repo/actions.ts:2932:30)apps/diffinery test:     at Actions.admit (/workspace/diffinery/apps/diffinery/src/repo/actions.ts:1284:30)apps/diffinery test:     at Actions.launch (/workspace/diffinery/apps/diffinery/src/repo/actions.ts:1238:34)apps/diffinery test:     at launch (/workspace/diffinery/apps/diffinery/test/unit/actions-runtime.test.ts:718:98)apps/diffinery test:     at /workspace/diffinery/apps/diffinery/test/unit/actions-runtime.test.ts:719:47apps/diffinery test:     at async file:///workspace/diffinery/node_modules/.pnpm/@vitest+runner@4.1.11/node_modules/@vitest/runner/dist/chunk-artifact.js:1903:20apps/diffinery test: stderr | test/unit/actions-runtime.test.ts > hosted runner slots > a repository runs at most SHARE hosted jobs at once; the rest wait their turnapps/diffinery test: quota check failed TypeError: Cannot read properties of undefined (reading 'prepare')apps/diffinery test:     at adminRun (/workspace/diffinery/apps/diffinery/src/lib/quotas.ts:50:26)apps/diffinery test:     at quotasFor (/workspace/diffinery/apps/diffinery/src/lib/quotas.ts:60:13)apps/diffinery test:     at mayStart (/workspace/diffinery/apps/diffinery/src/lib/quotas.ts:191:19)apps/diffinery test:     at Actions.admit (/workspace/diffinery/apps/diffinery/src/repo/actions.ts:1307:25)apps/diffinery test:     at Actions.launch (/workspace/diffinery/apps/diffinery/src/repo/actions.ts:1238:23)apps/diffinery test:     at /workspace/diffinery/apps/diffinery/test/unit/actions-runtime.test.ts:719:41apps/diffinery test:     at async file:///workspace/diffinery/node_modules/.pnpm/@vitest+runner@4.1.11/node_modules/@vitest/runner/dist/chunk-artifact.js:1903:20apps/diffinery test: stderr | test/unit/actions-runtime.test.ts > hosted runner slots > a repository runs at most SHARE hosted jobs at once; the rest wait their turnapps/diffinery test: compute usage failed TypeError: Cannot read properties of undefined (reading 'prepare')apps/diffinery test:     at startCompute (/workspace/diffinery/apps/diffinery/src/lib/quotas.ts:213:16)apps/diffinery test:     at Actions.admit (/workspace/diffinery/apps/diffinery/src/repo/actions.ts:1322:11)apps/diffinery test:     at Actions.launch (/workspace/diffinery/apps/diffinery/src/repo/actions.ts:1238:23)apps/diffinery test:     at /workspace/diffinery/apps/diffinery/test/unit/actions-runtime.test.ts:719:41apps/diffinery test:     at async file:///workspace/diffinery/node_modules/.pnpm/@vitest+runner@4.1.11/node_modules/@vitest/runner/dist/chunk-artifact.js:1903:20apps/diffinery test: stderr | test/unit/actions-runtime.test.ts > hosted runner slots > a repository runs at most SHARE hosted jobs at once; the rest wait their turnapps/diffinery test: kill switch check failed TypeError: Cannot read properties of undefined (reading 'prepare')apps/diffinery test:     at killSwitches (/workspace/diffinery/apps/diffinery/src/lib/killswitch.ts:46:26)apps/diffinery test:     at Actions.blocked (/workspace/diffinery/apps/diffinery/src/repo/actions.ts:2932:30)apps/diffinery test:     at Actions.admit (/workspace/diffinery/apps/diffinery/src/repo/actions.ts:1284:30)apps/diffinery test:     at Actions.launch (/workspace/diffinery/apps/diffinery/src/repo/actions.ts:1238:34)apps/diffinery test:     at launch (/workspace/diffinery/apps/diffinery/test/unit/actions-runtime.test.ts:718:98)apps/diffinery test:     at /workspace/diffinery/apps/diffinery/test/unit/actions-runtime.test.ts:719:47apps/diffinery test:     at async file:///workspace/diffinery/node_modules/.pnpm/@vitest+runner@4.1.11/node_modules/@vitest/runner/dist/chunk-artifact.js:1903:20apps/diffinery test: stderr | test/unit/actions-runtime.test.ts > hosted runner slots > a repository runs at most SHARE hosted jobs at once; the rest wait their turnapps/diffinery test: quota check failed TypeError: Cannot read properties of undefined (reading 'prepare')apps/diffinery test:     at adminRun (/workspace/diffinery/apps/diffinery/src/lib/quotas.ts:50:26)apps/diffinery test:     at quotasFor (/workspace/diffinery/apps/diffinery/src/lib/quotas.ts:60:13)apps/diffinery test:     at mayStart (/workspace/diffinery/apps/diffinery/src/lib/quotas.ts:191:19)apps/diffinery test:     at Actions.admit (/workspace/diffinery/apps/diffinery/src/repo/actions.ts:1307:25)apps/diffinery test:     at Actions.launch (/workspace/diffinery/apps/diffinery/src/repo/actions.ts:1238:23)apps/diffinery test:     at /workspace/diffinery/apps/diffinery/test/unit/actions-runtime.test.ts:719:41apps/diffinery test:     at async file:///workspace/diffinery/node_modules/.pnpm/@vitest+runner@4.1.11/node_modules/@vitest/runner/dist/chunk-artifact.js:1903:20apps/diffinery test: stderr | test/unit/actions-runtime.test.ts > hosted runner slots > a repository runs at most SHARE hosted jobs at once; the rest wait their turnapps/diffinery test: compute usage failed TypeError: Cannot read properties of undefined (reading 'prepare')apps/diffinery test:     at startCompute (/workspace/diffinery/apps/diffinery/src/lib/quotas.ts:213:16)apps/diffinery test:     at Actions.admit (/workspace/diffinery/apps/diffinery/src/repo/actions.ts:1322:11)apps/diffinery test:     at Actions.launch (/workspace/diffinery/apps/diffinery/src/repo/actions.ts:1238:23)apps/diffinery test:     at /workspace/diffinery/apps/diffinery/test/unit/actions-runtime.test.ts:719:41apps/diffinery test:     at async file:///workspace/diffinery/node_modules/.pnpm/@vitest+runner@4.1.11/node_modules/@vitest/runner/dist/chunk-artifact.js:1903:20apps/diffinery test: stderr | test/unit/actions-runtime.test.ts > hosted runner slots > a repository runs at most SHARE hosted jobs at once; the rest wait their turnapps/diffinery test: kill switch check failed TypeError: Cannot read properties of undefined (reading 'prepare')apps/diffinery test:     at killSwitches (/workspace/diffinery/apps/diffinery/src/lib/killswitch.ts:46:26)apps/diffinery test:     at Actions.blocked (/workspace/diffinery/apps/diffinery/src/repo/actions.ts:2932:30)apps/diffinery test:     at Actions.admit (/workspace/diffinery/apps/diffinery/src/repo/actions.ts:1284:30)apps/diffinery test:     at Actions.launch (/workspace/diffinery/apps/diffinery/src/repo/actions.ts:1238:34)apps/diffinery test:     at launch (/workspace/diffinery/apps/diffinery/test/unit/actions-runtime.test.ts:718:98)apps/diffinery test:     at /workspace/diffinery/apps/diffinery/test/unit/actions-runtime.test.ts:719:47apps/diffinery test:     at async file:///workspace/diffinery/node_modules/.pnpm/@vitest+runner@4.1.11/node_modules/@vitest/runner/dist/chunk-artifact.js:1903:20apps/diffinery test: stderr | test/unit/actions-runtime.test.ts > hosted runner slots > a repository runs at most SHARE hosted jobs at once; the rest wait their turnapps/diffinery test: quota check failed TypeError: Cannot read properties of undefined (reading 'prepare')apps/diffinery test:     at adminRun (/workspace/diffinery/apps/diffinery/src/lib/quotas.ts:50:26)apps/diffinery test:     at quotasFor (/workspace/diffinery/apps/diffinery/src/lib/quotas.ts:60:13)apps/diffinery test:     at mayStart (/workspace/diffinery/apps/diffinery/src/lib/quotas.ts:191:19)apps/diffinery test:     at Actions.admit (/workspace/diffinery/apps/diffinery/src/repo/actions.ts:1307:25)apps/diffinery test:     at Actions.launch (/workspace/diffinery/apps/diffinery/src/repo/actions.ts:1238:23)apps/diffinery test:     at /workspace/diffinery/apps/diffinery/test/unit/actions-runtime.test.ts:719:41apps/diffinery test:     at async file:///workspace/diffinery/node_modules/.pnpm/@vitest+runner@4.1.11/node_modules/@vitest/runner/dist/chunk-artifact.js:1903:20apps/diffinery test: stderr | test/unit/actions-runtime.test.ts > hosted runner slots > a repository runs at most SHARE hosted jobs at once; the rest wait their turnapps/diffinery test: compute usage failed TypeError: Cannot read properties of undefined (reading 'prepare')apps/diffinery test:     at startCompute (/workspace/diffinery/apps/diffinery/src/lib/quotas.ts:213:16)apps/diffinery test:     at Actions.admit (/workspace/diffinery/apps/diffinery/src/repo/actions.ts:1322:11)apps/diffinery test:     at Actions.launch (/workspace/diffinery/apps/diffinery/src/repo/actions.ts:1238:23)apps/diffinery test:     at /workspace/diffinery/apps/diffinery/test/unit/actions-runtime.test.ts:719:41apps/diffinery test:     at async file:///workspace/diffinery/node_modules/.pnpm/@vitest+runner@4.1.11/node_modules/@vitest/runner/dist/chunk-artifact.js:1903:20apps/diffinery test: stderr | test/unit/actions-runtime.test.ts > hosted runner slots > a repository runs at most SHARE hosted jobs at once; the rest wait their turnapps/diffinery test: kill switch check failed TypeError: Cannot read properties of undefined (reading 'prepare')apps/diffinery test:     at killSwitches (/workspace/diffinery/apps/diffinery/src/lib/killswitch.ts:46:26)apps/diffinery test:     at Actions.blocked (/workspace/diffinery/apps/diffinery/src/repo/actions.ts:2932:30)apps/diffinery test:     at Actions.admit (/workspace/diffinery/apps/diffinery/src/repo/actions.ts:1284:30)apps/diffinery test:     at Actions.launch (/workspace/diffinery/apps/diffinery/src/repo/actions.ts:1238:34)apps/diffinery test:     at launch (/workspace/diffinery/apps/diffinery/test/unit/actions-runtime.test.ts:718:98)apps/diffinery test:     at /workspace/diffinery/apps/diffinery/test/unit/actions-runtime.test.ts:719:47apps/diffinery test:     at async file:///workspace/diffinery/node_modules/.pnpm/@vitest+runner@4.1.11/node_modules/@vitest/runner/dist/chunk-artifact.js:1903:20apps/diffinery test: stderr | test/unit/actions-runtime.test.ts > hosted runner slots > a repository runs at most SHARE hosted jobs at once; the rest wait their turnapps/diffinery test: quota check failed TypeError: Cannot read properties of undefined (reading 'prepare')apps/diffinery test:     at adminRun (/workspace/diffinery/apps/diffinery/src/lib/quotas.ts:50:26)apps/diffinery test:     at quotasFor (/workspace/diffinery/apps/diffinery/src/lib/quotas.ts:60:13)apps/diffinery test:     at mayStart (/workspace/diffinery/apps/diffinery/src/lib/quotas.ts:191:19)apps/diffinery test:     at Actions.admit (/workspace/diffinery/apps/diffinery/src/repo/actions.ts:1307:25)apps/diffinery test:     at Actions.launch (/workspace/diffinery/apps/diffinery/src/repo/actions.ts:1238:23)apps/diffinery test:     at /workspace/diffinery/apps/diffinery/test/unit/actions-runtime.test.ts:719:41apps/diffinery test:     at async file:///workspace/diffinery/node_modules/.pnpm/@vitest+runner@4.1.11/node_modules/@vitest/runner/dist/chunk-artifact.js:1903:20apps/diffinery test: stderr | test/unit/actions-runtime.test.ts > hosted runner slots > a repository runs at most SHARE hosted jobs at once; the rest wait their turnapps/diffinery test: compute usage failed TypeError: Cannot read properties of undefined (reading 'prepare')apps/diffinery test:     at startCompute (/workspace/diffinery/apps/diffinery/src/lib/quotas.ts:213:16)apps/diffinery test:     at Actions.admit (/workspace/diffinery/apps/diffinery/src/repo/actions.ts:1322:11)apps/diffinery test:     at Actions.launch (/workspace/diffinery/apps/diffinery/src/repo/actions.ts:1238:23)apps/diffinery test:     at /workspace/diffinery/apps/diffinery/test/unit/actions-runtime.test.ts:719:41apps/diffinery test:     at async file:///workspace/diffinery/node_modules/.pnpm/@vitest+runner@4.1.11/node_modules/@vitest/runner/dist/chunk-artifact.js:1903:20apps/diffinery test: stderr | test/unit/actions-runtime.test.ts > hosted runner slots > a repository runs at most SHARE hosted jobs at once; the rest wait their turnapps/diffinery test: kill switch check failed TypeError: Cannot read properties of undefined (reading 'prepare')apps/diffinery test:     at killSwitches (/workspace/diffinery/apps/diffinery/src/lib/killswitch.ts:46:26)apps/diffinery test:     at Actions.blocked (/workspace/diffinery/apps/diffinery/src/repo/actions.ts:2932:30)apps/diffinery test:     at Actions.admit (/workspace/diffinery/apps/diffinery/src/repo/actions.ts:1284:30)apps/diffinery test:     at Actions.launch (/workspace/diffinery/apps/diffinery/src/repo/actions.ts:1238:34)apps/diffinery test:     at launch (/workspace/diffinery/apps/diffinery/test/unit/actions-runtime.test.ts:718:98)apps/diffinery test:     at /workspace/diffinery/apps/diffinery/test/unit/actions-runtime.test.ts:719:47apps/diffinery test:     at async file:///workspace/diffinery/node_modules/.pnpm/@vitest+runner@4.1.11/node_modules/@vitest/runner/dist/chunk-artifact.js:1903:20apps/diffinery test: stderr | test/unit/actions-runtime.test.ts > hosted runner slots > a repository runs at most SHARE hosted jobs at once; the rest wait their turnapps/diffinery test: quota check failed TypeError: Cannot read properties of undefined (reading 'prepare')apps/diffinery test:     at adminRun (/workspace/diffinery/apps/diffinery/src/lib/quotas.ts:50:26)apps/diffinery test:     at quotasFor (/workspace/diffinery/apps/diffinery/src/lib/quotas.ts:60:13)apps/diffinery test:     at mayStart (/workspace/diffinery/apps/diffinery/src/lib/quotas.ts:191:19)apps/diffinery test:     at Actions.admit (/workspace/diffinery/apps/diffinery/src/repo/actions.ts:1307:25)apps/diffinery test:     at Actions.launch (/workspace/diffinery/apps/diffinery/src/repo/actions.ts:1238:23)apps/diffinery test:     at /workspace/diffinery/apps/diffinery/test/unit/actions-runtime.test.ts:719:41apps/diffinery test:     at async file:///workspace/diffinery/node_modules/.pnpm/@vitest+runner@4.1.11/node_modules/@vitest/runner/dist/chunk-artifact.js:1903:20apps/diffinery test: stderr | test/unit/actions-runtime.test.ts > hosted runner slots > a repository runs at most SHARE hosted jobs at once; the rest wait their turnapps/diffinery test: compute usage failed TypeError: Cannot read properties of undefined (reading 'prepare')apps/diffinery test:     at startCompute (/workspace/diffinery/apps/diffinery/src/lib/quotas.ts:213:16)apps/diffinery test:     at Actions.admit (/workspace/diffinery/apps/diffinery/src/repo/actions.ts:1322:11)apps/diffinery test:     at Actions.launch (/workspace/diffinery/apps/diffinery/src/repo/actions.ts:1238:23)apps/diffinery test:     at /workspace/diffinery/apps/diffinery/test/unit/actions-runtime.test.ts:719:41apps/diffinery test:     at async file:///workspace/diffinery/node_modules/.pnpm/@vitest+runner@4.1.11/node_modules/@vitest/runner/dist/chunk-artifact.js:1903:20apps/diffinery test: stderr | test/unit/actions-runtime.test.ts > hosted runner slots > a repository runs at most SHARE hosted jobs at once; the rest wait their turnapps/diffinery test: kill switch check failed TypeError: Cannot read properties of undefined (reading 'prepare')apps/diffinery test:     at killSwitches (/workspace/diffinery/apps/diffinery/src/lib/killswitch.ts:46:26)apps/diffinery test:     at Actions.blocked (/workspace/diffinery/apps/diffinery/src/repo/actions.ts:2932:30)apps/diffinery test:     at Actions.admit (/workspace/diffinery/apps/diffinery/src/repo/actions.ts:1284:30)apps/diffinery test:     at Actions.launch (/workspace/diffinery/apps/diffinery/src/repo/actions.ts:1238:34)apps/diffinery test:     at launch (/workspace/diffinery/apps/diffinery/test/unit/actions-runtime.test.ts:718:98)apps/diffinery test:     at /workspace/diffinery/apps/diffinery/test/unit/actions-runtime.test.ts:719:47apps/diffinery test:     at async file:///workspace/diffinery/node_modules/.pnpm/@vitest+runner@4.1.11/node_modules/@vitest/runner/dist/chunk-artifact.js:1903:20apps/diffinery test: stderr | test/unit/actions-runtime.test.ts > hosted runner slots > a repository runs at most SHARE hosted jobs at once; the rest wait their turnapps/diffinery test: quota check failed TypeError: Cannot read properties of undefined (reading 'prepare')apps/diffinery test:     at adminRun (/workspace/diffinery/apps/diffinery/src/lib/quotas.ts:50:26)apps/diffinery test:     at quotasFor (/workspace/diffinery/apps/diffinery/src/lib/quotas.ts:60:13)apps/diffinery test:     at mayStart (/workspace/diffinery/apps/diffinery/src/lib/quotas.ts:191:19)apps/diffinery test:     at Actions.admit (/workspace/diffinery/apps/diffinery/src/repo/actions.ts:1307:25)apps/diffinery test:     at Actions.launch (/workspace/diffinery/apps/diffinery/src/repo/actions.ts:1238:23)apps/diffinery test:     at /workspace/diffinery/apps/diffinery/test/unit/actions-runtime.test.ts:719:41apps/diffinery test:     at async file:///workspace/diffinery/node_modules/.pnpm/@vitest+runner@4.1.11/node_modules/@vitest/runner/dist/chunk-artifact.js:1903:20apps/diffinery test: stderr | test/unit/actions-runtime.test.ts > hosted runner slots > a repository runs at most SHARE hosted jobs at once; the rest wait their turnapps/diffinery test: compute usage failed TypeError: Cannot read properties of undefined (reading 'prepare')apps/diffinery test:     at startCompute (/workspace/diffinery/apps/diffinery/src/lib/quotas.ts:213:16)apps/diffinery test:     at Actions.admit (/workspace/diffinery/apps/diffinery/src/repo/actions.ts:1322:11)apps/diffinery test:     at Actions.launch (/workspace/diffinery/apps/diffinery/src/repo/actions.ts:1238:23)apps/diffinery test:     at /workspace/diffinery/apps/diffinery/test/unit/actions-runtime.test.ts:719:41apps/diffinery test:     at async file:///workspace/diffinery/node_modules/.pnpm/@vitest+runner@4.1.11/node_modules/@vitest/runner/dist/chunk-artifact.js:1903:20apps/diffinery test: stderr | test/unit/actions-runtime.test.ts > hosted runner slots > a repository runs at most SHARE hosted jobs at once; the rest wait their turnapps/diffinery test: kill switch check failed TypeError: Cannot read properties of undefined (reading 'prepare')apps/diffinery test:     at killSwitches (/workspace/diffinery/apps/diffinery/src/lib/killswitch.ts:46:26)apps/diffinery test:     at Actions.blocked (/workspace/diffinery/apps/diffinery/src/repo/actions.ts:2932:30)apps/diffinery test:     at Actions.admit (/workspace/diffinery/apps/diffinery/src/repo/actions.ts:1284:30)apps/diffinery test:     at Actions.launch (/workspace/diffinery/apps/diffinery/src/repo/actions.ts:1238:34)apps/diffinery test:     at launch (/workspace/diffinery/apps/diffinery/test/unit/actions-runtime.test.ts:718:98)apps/diffinery test:     at /workspace/diffinery/apps/diffinery/test/unit/actions-runtime.test.ts:719:47apps/diffinery test:     at async file:///workspace/diffinery/node_modules/.pnpm/@vitest+runner@4.1.11/node_modules/@vitest/runner/dist/chunk-artifact.js:1903:20apps/diffinery test: stderr | test/unit/actions-runtime.test.ts > hosted runner slots > a repository runs at most SHARE hosted jobs at once; the rest wait their turnapps/diffinery test: quota check failed TypeError: Cannot read properties of undefined (reading 'prepare')apps/diffinery test:     at adminRun (/workspace/diffinery/apps/diffinery/src/lib/quotas.ts:50:26)apps/diffinery test:     at quotasFor (/workspace/diffinery/apps/diffinery/src/lib/quotas.ts:60:13)apps/diffinery test:     at mayStart (/workspace/diffinery/apps/diffinery/src/lib/quotas.ts:191:19)apps/diffinery test:     at Actions.admit (/workspace/diffinery/apps/diffinery/src/repo/actions.ts:1307:25)apps/diffinery test:     at Actions.launch (/workspace/diffinery/apps/diffinery/src/repo/actions.ts:1238:23)apps/diffinery test:     at /workspace/diffinery/apps/diffinery/test/unit/actions-runtime.test.ts:719:41apps/diffinery test:     at async file:///workspace/diffinery/node_modules/.pnpm/@vitest+runner@4.1.11/node_modules/@vitest/runner/dist/chunk-artifact.js:1903:20apps/diffinery test: stderr | test/unit/actions-runtime.test.ts > hosted runner slots > a repository runs at most SHARE hosted jobs at once; the rest wait their turnapps/diffinery test: compute usage failed TypeError: Cannot read properties of undefined (reading 'prepare')apps/diffinery test:     at startCompute (/workspace/diffinery/apps/diffinery/src/lib/quotas.ts:213:16)apps/diffinery test:     at Actions.admit (/workspace/diffinery/apps/diffinery/src/repo/actions.ts:1322:11)apps/diffinery test:     at Actions.launch (/workspace/diffinery/apps/diffinery/src/repo/actions.ts:1238:23)apps/diffinery test:     at /workspace/diffinery/apps/diffinery/test/unit/actions-runtime.test.ts:719:41apps/diffinery test:     at async file:///workspace/diffinery/node_modules/.pnpm/@vitest+runner@4.1.11/node_modules/@vitest/runner/dist/chunk-artifact.js:1903:20apps/diffinery test: stderr | test/unit/actions-runtime.test.ts > hosted runner slots > a repository runs at most SHARE hosted jobs at once; the rest wait their turnapps/diffinery test: kill switch check failed TypeError: Cannot read properties of undefined (reading 'prepare')apps/diffinery test:     at killSwitches (/workspace/diffinery/apps/diffinery/src/lib/killswitch.ts:46:26)apps/diffinery test:     at Actions.blocked (/workspace/diffinery/apps/diffinery/src/repo/actions.ts:2932:30)apps/diffinery test:     at Actions.admit (/workspace/diffinery/apps/diffinery/src/repo/actions.ts:1284:30)apps/diffinery test:     at Actions.launch (/workspace/diffinery/apps/diffinery/src/repo/actions.ts:1238:34)apps/diffinery test:     at launch (/workspace/diffinery/apps/diffinery/test/unit/actions-runtime.test.ts:718:98)apps/diffinery test:     at /workspace/diffinery/apps/diffinery/test/unit/actions-runtime.test.ts:719:47apps/diffinery test:     at async file:///workspace/diffinery/node_modules/.pnpm/@vitest+runner@4.1.11/node_modules/@vitest/runner/dist/chunk-artifact.js:1903:20apps/diffinery test: stderr | test/unit/actions-runtime.test.ts > hosted runner slots > a repository runs at most SHARE hosted jobs at once; the rest wait their turnapps/diffinery test: quota check failed TypeError: Cannot read properties of undefined (reading 'prepare')apps/diffinery test:     at adminRun (/workspace/diffinery/apps/diffinery/src/lib/quotas.ts:50:26)apps/diffinery test:     at quotasFor (/workspace/diffinery/apps/diffinery/src/lib/quotas.ts:60:13)apps/diffinery test:     at mayStart (/workspace/diffinery/apps/diffinery/src/lib/quotas.ts:191:19)apps/diffinery test:     at Actions.admit (/workspace/diffinery/apps/diffinery/src/repo/actions.ts:1307:25)apps/diffinery test:     at Actions.launch (/workspace/diffinery/apps/diffinery/src/repo/actions.ts:1238:23)apps/diffinery test:     at /workspace/diffinery/apps/diffinery/test/unit/actions-runtime.test.ts:719:41apps/diffinery test:     at async file:///workspace/diffinery/node_modules/.pnpm/@vitest+runner@4.1.11/node_modules/@vitest/runner/dist/chunk-artifact.js:1903:20apps/diffinery test: stderr | test/unit/actions-runtime.test.ts > hosted runner slots > a repository runs at most SHARE hosted jobs at once; the rest wait their turnapps/diffinery test: compute usage failed TypeError: Cannot read properties of undefined (reading 'prepare')apps/diffinery test:     at startCompute (/workspace/diffinery/apps/diffinery/src/lib/quotas.ts:213:16)apps/diffinery test:     at Actions.admit (/workspace/diffinery/apps/diffinery/src/repo/actions.ts:1322:11)apps/diffinery test:     at Actions.launch (/workspace/diffinery/apps/diffinery/src/repo/actions.ts:1238:23)apps/diffinery test:     at /workspace/diffinery/apps/diffinery/test/unit/actions-runtime.test.ts:719:41apps/diffinery test:     at async file:///workspace/diffinery/node_modules/.pnpm/@vitest+runner@4.1.11/node_modules/@vitest/runner/dist/chunk-artifact.js:1903:20apps/diffinery test: stderr | test/unit/actions-runtime.test.ts > hosted runner slots > a repository runs at most SHARE hosted jobs at once; the rest wait their turnapps/diffinery test: kill switch check failed TypeError: Cannot read properties of undefined (reading 'prepare')apps/diffinery test:     at killSwitches (/workspace/diffinery/apps/diffinery/src/lib/killswitch.ts:46:26)apps/diffinery test:     at Actions.blocked (/workspace/diffinery/apps/diffinery/src/repo/actions.ts:2932:30)apps/diffinery test:     at Actions.admit (/workspace/diffinery/apps/diffinery/src/repo/actions.ts:1284:30)apps/diffinery test:     at Actions.launch (/workspace/diffinery/apps/diffinery/src/repo/actions.ts:1238:34)apps/diffinery test:     at launch (/workspace/diffinery/apps/diffinery/test/unit/actions-runtime.test.ts:718:98)apps/diffinery test:     at /workspace/diffinery/apps/diffinery/test/unit/actions-runtime.test.ts:719:47apps/diffinery test:     at async file:///workspace/diffinery/node_modules/.pnpm/@vitest+runner@4.1.11/node_modules/@vitest/runner/dist/chunk-artifact.js:1903:20apps/diffinery test: stderr | test/unit/actions-runtime.test.ts > hosted runner slots > a repository runs at most SHARE hosted jobs at once; the rest wait their turnapps/diffinery test: quota check failed TypeError: Cannot read properties of undefined (reading 'prepare')apps/diffinery test:     at adminRun (/workspace/diffinery/apps/diffinery/src/lib/quotas.ts:50:26)apps/diffinery test:     at quotasFor (/workspace/diffinery/apps/diffinery/src/lib/quotas.ts:60:13)apps/diffinery test:     at mayStart (/workspace/diffinery/apps/diffinery/src/lib/quotas.ts:191:19)apps/diffinery test:     at Actions.admit (/workspace/diffinery/apps/diffinery/src/repo/actions.ts:1307:25)apps/diffinery test:     at Actions.launch (/workspace/diffinery/apps/diffinery/src/repo/actions.ts:1238:23)apps/diffinery test:     at /workspace/diffinery/apps/diffinery/test/unit/actions-runtime.test.ts:719:41apps/diffinery test:     at async file:///workspace/diffinery/node_modules/.pnpm/@vitest+runner@4.1.11/node_modules/@vitest/runner/dist/chunk-artifact.js:1903:20apps/diffinery test: stderr | test/unit/actions-runtime.test.ts > hosted runner slots > a repository runs at most SHARE hosted jobs at once; the rest wait their turnapps/diffinery test: compute usage failed TypeError: Cannot read properties of undefined (reading 'prepare')apps/diffinery test:     at startCompute (/workspace/diffinery/apps/diffinery/src/lib/quotas.ts:213:16)apps/diffinery test:     at Actions.admit (/workspace/diffinery/apps/diffinery/src/repo/actions.ts:1322:11)apps/diffinery test:     at Actions.launch (/workspace/diffinery/apps/diffinery/src/repo/actions.ts:1238:23)apps/diffinery test:     at /workspace/diffinery/apps/diffinery/test/unit/actions-runtime.test.ts:719:41apps/diffinery test:     at async file:///workspace/diffinery/node_modules/.pnpm/@vitest+runner@4.1.11/node_modules/@vitest/runner/dist/chunk-artifact.js:1903:20apps/diffinery test: stderr | test/unit/actions-runtime.test.ts > hosted runner slots > a repository runs at most SHARE hosted jobs at once; the rest wait their turnapps/diffinery test: kill switch check failed TypeError: Cannot read properties of undefined (reading 'prepare')apps/diffinery test:     at killSwitches (/workspace/diffinery/apps/diffinery/src/lib/killswitch.ts:46:26)apps/diffinery test:     at Actions.blocked (/workspace/diffinery/apps/diffinery/src/repo/actions.ts:2932:30)apps/diffinery test:     at Actions.admit (/workspace/diffinery/apps/diffinery/src/repo/actions.ts:1284:30)apps/diffinery test:     at Actions.launch (/workspace/diffinery/apps/diffinery/src/repo/actions.ts:1238:34)apps/diffinery test:     at launch (/workspace/diffinery/apps/diffinery/test/unit/actions-runtime.test.ts:718:98)apps/diffinery test:     at /workspace/diffinery/apps/diffinery/test/unit/actions-runtime.test.ts:719:47apps/diffinery test:     at async file:///workspace/diffinery/node_modules/.pnpm/@vitest+runner@4.1.11/node_modules/@vitest/runner/dist/chunk-artifact.js:1903:20apps/diffinery test: stderr | test/unit/actions-runtime.test.ts > hosted runner slots > a repository runs at most SHARE hosted jobs at once; the rest wait their turnapps/diffinery test: quota check failed TypeError: Cannot read properties of undefined (reading 'prepare')apps/diffinery test:     at adminRun (/workspace/diffinery/apps/diffinery/src/lib/quotas.ts:50:26)apps/diffinery test:     at quotasFor (/workspace/diffinery/apps/diffinery/src/lib/quotas.ts:60:13)apps/diffinery test:     at mayStart (/workspace/diffinery/apps/diffinery/src/lib/quotas.ts:191:19)apps/diffinery test:     at Actions.admit (/workspace/diffinery/apps/diffinery/src/repo/actions.ts:1307:25)apps/diffinery test:     at Actions.launch (/workspace/diffinery/apps/diffinery/src/repo/actions.ts:1238:23)apps/diffinery test:     at /workspace/diffinery/apps/diffinery/test/unit/actions-runtime.test.ts:719:41apps/diffinery test:     at async file:///workspace/diffinery/node_modules/.pnpm/@vitest+runner@4.1.11/node_modules/@vitest/runner/dist/chunk-artifact.js:1903:20apps/diffinery test: stderr | test/unit/actions-runtime.test.ts > hosted runner slots > a repository runs at most SHARE hosted jobs at once; the rest wait their turnapps/diffinery test: compute usage failed TypeError: Cannot read properties of undefined (reading 'prepare')apps/diffinery test:     at startCompute (/workspace/diffinery/apps/diffinery/src/lib/quotas.ts:213:16)apps/diffinery test:     at Actions.admit (/workspace/diffinery/apps/diffinery/src/repo/actions.ts:1322:11)apps/diffinery test:     at Actions.launch (/workspace/diffinery/apps/diffinery/src/repo/actions.ts:1238:23)apps/diffinery test:     at /workspace/diffinery/apps/diffinery/test/unit/actions-runtime.test.ts:719:41apps/diffinery test:     at async file:///workspace/diffinery/node_modules/.pnpm/@vitest+runner@4.1.11/node_modules/@vitest/runner/dist/chunk-artifact.js:1903:20apps/diffinery test: stderr | test/unit/actions-runtime.test.ts > hosted runner slots > a repository runs at most SHARE hosted jobs at once; the rest wait their turnapps/diffinery test: kill switch check failed TypeError: Cannot read properties of undefined (reading 'prepare')apps/diffinery test:     at killSwitches (/workspace/diffinery/apps/diffinery/src/lib/killswitch.ts:46:26)apps/diffinery test:     at Actions.blocked (/workspace/diffinery/apps/diffinery/src/repo/actions.ts:2932:30)apps/diffinery test:     at Actions.admit (/workspace/diffinery/apps/diffinery/src/repo/actions.ts:1284:30)apps/diffinery test:     at Actions.launch (/workspace/diffinery/apps/diffinery/src/repo/actions.ts:1238:34)apps/diffinery test:     at launch (/workspace/diffinery/apps/diffinery/test/unit/actions-runtime.test.ts:718:98)apps/diffinery test:     at /workspace/diffinery/apps/diffinery/test/unit/actions-runtime.test.ts:719:47apps/diffinery test:     at async file:///workspace/diffinery/node_modules/.pnpm/@vitest+runner@4.1.11/node_modules/@vitest/runner/dist/chunk-artifact.js:1903:20apps/diffinery test: stderr | test/unit/actions-runtime.test.ts > hosted runner slots > a repository runs at most SHARE hosted jobs at once; the rest wait their turnapps/diffinery test: quota check failed TypeError: Cannot read properties of undefined (reading 'prepare')apps/diffinery test:     at adminRun (/workspace/diffinery/apps/diffinery/src/lib/quotas.ts:50:26)apps/diffinery test:     at quotasFor (/workspace/diffinery/apps/diffinery/src/lib/quotas.ts:60:13)apps/diffinery test:     at mayStart (/workspace/diffinery/apps/diffinery/src/lib/quotas.ts:191:19)apps/diffinery test:     at Actions.admit (/workspace/diffinery/apps/diffinery/src/repo/actions.ts:1307:25)apps/diffinery test:     at Actions.launch (/workspace/diffinery/apps/diffinery/src/repo/actions.ts:1238:23)apps/diffinery test:     at /workspace/diffinery/apps/diffinery/test/unit/actions-runtime.test.ts:719:41apps/diffinery test:     at async file:///workspace/diffinery/node_modules/.pnpm/@vitest+runner@4.1.11/node_modules/@vitest/runner/dist/chunk-artifact.js:1903:20apps/diffinery test: stderr | test/unit/actions-runtime.test.ts > hosted runner slots > a repository runs at most SHARE hosted jobs at once; the rest wait their turnapps/diffinery test: compute usage failed TypeError: Cannot read properties of undefined (reading 'prepare')apps/diffinery test:     at startCompute (/workspace/diffinery/apps/diffinery/src/lib/quotas.ts:213:16)apps/diffinery test:     at Actions.admit (/workspace/diffinery/apps/diffinery/src/repo/actions.ts:1322:11)apps/diffinery test:     at Actions.launch (/workspace/diffinery/apps/diffinery/src/repo/actions.ts:1238:23)apps/diffinery test:     at /workspace/diffinery/apps/diffinery/test/unit/actions-runtime.test.ts:719:41apps/diffinery test:     at async file:///workspace/diffinery/node_modules/.pnpm/@vitest+runner@4.1.11/node_modules/@vitest/runner/dist/chunk-artifact.js:1903:20apps/diffinery test: stderr | test/unit/actions-runtime.test.ts > hosted runner slots > a repository runs at most SHARE hosted jobs at once; the rest wait their turnapps/diffinery test: kill switch check failed TypeError: Cannot read properties of undefined (reading 'prepare')apps/diffinery test:     at killSwitches (/workspace/diffinery/apps/diffinery/src/lib/killswitch.ts:46:26)apps/diffinery test:     at Actions.blocked (/workspace/diffinery/apps/diffinery/src/repo/actions.ts:2932:30)apps/diffinery test:     at Actions.admit (/workspace/diffinery/apps/diffinery/src/repo/actions.ts:1284:30)apps/diffinery test:     at Actions.launch (/workspace/diffinery/apps/diffinery/src/repo/actions.ts:1238:34)apps/diffinery test:     at launch (/workspace/diffinery/apps/diffinery/test/unit/actions-runtime.test.ts:718:98)apps/diffinery test:     at /workspace/diffinery/apps/diffinery/test/unit/actions-runtime.test.ts:719:47apps/diffinery test:     at async file:///workspace/diffinery/node_modules/.pnpm/@vitest+runner@4.1.11/node_modules/@vitest/runner/dist/chunk-artifact.js:1903:20apps/diffinery test: stderr | test/unit/actions-runtime.test.ts > hosted runner slots > a repository runs at most SHARE hosted jobs at once; the rest wait their turnapps/diffinery test: quota check failed TypeError: Cannot read properties of undefined (reading 'prepare')apps/diffinery test:     at adminRun (/workspace/diffinery/apps/diffinery/src/lib/quotas.ts:50:26)apps/diffinery test:     at quotasFor (/workspace/diffinery/apps/diffinery/src/lib/quotas.ts:60:13)apps/diffinery test:     at mayStart (/workspace/diffinery/apps/diffinery/src/lib/quotas.ts:191:19)apps/diffinery test:     at Actions.admit (/workspace/diffinery/apps/diffinery/src/repo/actions.ts:1307:25)apps/diffinery test:     at Actions.launch (/workspace/diffinery/apps/diffinery/src/repo/actions.ts:1238:23)apps/diffinery test:     at /workspace/diffinery/apps/diffinery/test/unit/actions-runtime.test.ts:719:41apps/diffinery test:     at async file:///workspace/diffinery/node_modules/.pnpm/@vitest+runner@4.1.11/node_modules/@vitest/runner/dist/chunk-artifact.js:1903:20apps/diffinery test: stderr | test/unit/actions-runtime.test.ts > hosted runner slots > a repository runs at most SHARE hosted jobs at once; the rest wait their turnapps/diffinery test: compute usage failed TypeError: Cannot read properties of undefined (reading 'prepare')apps/diffinery test:     at startCompute (/workspace/diffinery/apps/diffinery/src/lib/quotas.ts:213:16)apps/diffinery test:     at Actions.admit (/workspace/diffinery/apps/diffinery/src/repo/actions.ts:1322:11)apps/diffinery test:     at Actions.launch (/workspace/diffinery/apps/diffinery/src/repo/actions.ts:1238:23)apps/diffinery test:     at /workspace/diffinery/apps/diffinery/test/unit/actions-runtime.test.ts:719:41apps/diffinery test:     at async file:///workspace/diffinery/node_modules/.pnpm/@vitest+runner@4.1.11/node_modules/@vitest/runner/dist/chunk-artifact.js:1903:20apps/diffinery test: stderr | test/unit/actions-runtime.test.ts > hosted runner slots > a repository runs at most SHARE hosted jobs at once; the rest wait their turnapps/diffinery test: kill switch check failed TypeError: Cannot read properties of undefined (reading 'prepare')apps/diffinery test:     at killSwitches (/workspace/diffinery/apps/diffinery/src/lib/killswitch.ts:46:26)apps/diffinery test:     at Actions.blocked (/workspace/diffinery/apps/diffinery/src/repo/actions.ts:2932:30)apps/diffinery test:     at Actions.admit (/workspace/diffinery/apps/diffinery/src/repo/actions.ts:1284:30)apps/diffinery test:     at Actions.launch (/workspace/diffinery/apps/diffinery/src/repo/actions.ts:1238:34)apps/diffinery test:     at launch (/workspace/diffinery/apps/diffinery/test/unit/actions-runtime.test.ts:718:98)apps/diffinery test:     at /workspace/diffinery/apps/diffinery/test/unit/actions-runtime.test.ts:719:47apps/diffinery test:     at async file:///workspace/diffinery/node_modules/.pnpm/@vitest+runner@4.1.11/node_modules/@vitest/runner/dist/chunk-artifact.js:1903:20apps/diffinery test: stderr | test/unit/actions-runtime.test.ts > hosted runner slots > a repository runs at most SHARE hosted jobs at once; the rest wait their turnapps/diffinery test: quota check failed TypeError: Cannot read properties of undefined (reading 'prepare')apps/diffinery test:     at adminRun (/workspace/diffinery/apps/diffinery/src/lib/quotas.ts:50:26)apps/diffinery test:     at quotasFor (/workspace/diffinery/apps/diffinery/src/lib/quotas.ts:60:13)apps/diffinery test:     at mayStart (/workspace/diffinery/apps/diffinery/src/lib/quotas.ts:191:19)apps/diffinery test:     at Actions.admit (/workspace/diffinery/apps/diffinery/src/repo/actions.ts:1307:25)apps/diffinery test:     at Actions.launch (/workspace/diffinery/apps/diffinery/src/repo/actions.ts:1238:23)apps/diffinery test:     at /workspace/diffinery/apps/diffinery/test/unit/actions-runtime.test.ts:719:41apps/diffinery test:     at async file:///workspace/diffinery/node_modules/.pnpm/@vitest+runner@4.1.11/node_modules/@vitest/runner/dist/chunk-artifact.js:1903:20apps/diffinery test: stderr | test/unit/actions-runtime.test.ts > hosted runner slots > a repository runs at most SHARE hosted jobs at once; the rest wait their turnapps/diffinery test: compute usage failed TypeError: Cannot read properties of undefined (reading 'prepare')apps/diffinery test:     at startCompute (/workspace/diffinery/apps/diffinery/src/lib/quotas.ts:213:16)apps/diffinery test:     at Actions.admit (/workspace/diffinery/apps/diffinery/src/repo/actions.ts:1322:11)apps/diffinery test:     at Actions.launch (/workspace/diffinery/apps/diffinery/src/repo/actions.ts:1238:23)apps/diffinery test:     at /workspace/diffinery/apps/diffinery/test/unit/actions-runtime.test.ts:719:41apps/diffinery test:     at async file:///workspace/diffinery/node_modules/.pnpm/@vitest+runner@4.1.11/node_modules/@vitest/runner/dist/chunk-artifact.js:1903:20apps/diffinery test: stderr | test/unit/actions-runtime.test.ts > hosted runner slots > a repository runs at most SHARE hosted jobs at once; the rest wait their turnapps/diffinery test: kill switch check failed TypeError: Cannot read properties of undefined (reading 'prepare')apps/diffinery test:     at killSwitches (/workspace/diffinery/apps/diffinery/src/lib/killswitch.ts:46:26)apps/diffinery test:     at Actions.blocked (/workspace/diffinery/apps/diffinery/src/repo/actions.ts:2932:30)apps/diffinery test:     at Actions.admit (/workspace/diffinery/apps/diffinery/src/repo/actions.ts:1284:30)apps/diffinery test:     at Actions.launch (/workspace/diffinery/apps/diffinery/src/repo/actions.ts:1238:34)apps/diffinery test:     at launch (/workspace/diffinery/apps/diffinery/test/unit/actions-runtime.test.ts:718:98)apps/diffinery test:     at /workspace/diffinery/apps/diffinery/test/unit/actions-runtime.test.ts:719:47apps/diffinery test:     at async file:///workspace/diffinery/node_modules/.pnpm/@vitest+runner@4.1.11/node_modules/@vitest/runner/dist/chunk-artifact.js:1903:20apps/diffinery test: stderr | test/unit/actions-runtime.test.ts > hosted runner slots > a repository runs at most SHARE hosted jobs at once; the rest wait their turnapps/diffinery test: quota check failed TypeError: Cannot read properties of undefined (reading 'prepare')apps/diffinery test:     at adminRun (/workspace/diffinery/apps/diffinery/src/lib/quotas.ts:50:26)apps/diffinery test:     at quotasFor (/workspace/diffinery/apps/diffinery/src/lib/quotas.ts:60:13)apps/diffinery test:     at mayStart (/workspace/diffinery/apps/diffinery/src/lib/quotas.ts:191:19)apps/diffinery test:     at Actions.admit (/workspace/diffinery/apps/diffinery/src/repo/actions.ts:1307:25)apps/diffinery test:     at Actions.launch (/workspace/diffinery/apps/diffinery/src/repo/actions.ts:1238:23)apps/diffinery test:     at /workspace/diffinery/apps/diffinery/test/unit/actions-runtime.test.ts:719:41apps/diffinery test:     at async file:///workspace/diffinery/node_modules/.pnpm/@vitest+runner@4.1.11/node_modules/@vitest/runner/dist/chunk-artifact.js:1903:20apps/diffinery test: stderr | test/unit/actions-runtime.test.ts > hosted runner slots > a repository runs at most SHARE hosted jobs at once; the rest wait their turnapps/diffinery test: compute usage failed TypeError: Cannot read properties of undefined (reading 'prepare')apps/diffinery test:     at startCompute (/workspace/diffinery/apps/diffinery/src/lib/quotas.ts:213:16)apps/diffinery test:     at Actions.admit (/workspace/diffinery/apps/diffinery/src/repo/actions.ts:1322:11)apps/diffinery test:     at Actions.launch (/workspace/diffinery/apps/diffinery/src/repo/actions.ts:1238:23)apps/diffinery test:     at /workspace/diffinery/apps/diffinery/test/unit/actions-runtime.test.ts:719:41apps/diffinery test:     at async file:///workspace/diffinery/node_modules/.pnpm/@vitest+runner@4.1.11/node_modules/@vitest/runner/dist/chunk-artifact.js:1903:20apps/diffinery test: stderr | test/unit/actions-runtime.test.ts > hosted runner slots > a repository runs at most SHARE hosted jobs at once; the rest wait their turnapps/diffinery test: kill switch check failed TypeError: Cannot read properties of undefined (reading 'prepare')apps/diffinery test:     at killSwitches (/workspace/diffinery/apps/diffinery/src/lib/killswitch.ts:46:26)apps/diffinery test:     at Actions.blocked (/workspace/diffinery/apps/diffinery/src/repo/actions.ts:2932:30)apps/diffinery test:     at Actions.admit (/workspace/diffinery/apps/diffinery/src/repo/actions.ts:1284:30)apps/diffinery test:     at Actions.launch (/workspace/diffinery/apps/diffinery/src/repo/actions.ts:1238:34)apps/diffinery test:     at launch (/workspace/diffinery/apps/diffinery/test/unit/actions-runtime.test.ts:718:98)apps/diffinery test:     at /workspace/diffinery/apps/diffinery/test/unit/actions-runtime.test.ts:719:47apps/diffinery test:     at async file:///workspace/diffinery/node_modules/.pnpm/@vitest+runner@4.1.11/node_modules/@vitest/runner/dist/chunk-artifact.js:1903:20apps/diffinery test: stderr | test/unit/actions-runtime.test.ts > hosted runner slots > a repository runs at most SHARE hosted jobs at once; the rest wait their turnapps/diffinery test: quota check failed TypeError: Cannot read properties of undefined (reading 'prepare')apps/diffinery test:     at adminRun (/workspace/diffinery/apps/diffinery/src/lib/quotas.ts:50:26)apps/diffinery test:     at quotasFor (/workspace/diffinery/apps/diffinery/src/lib/quotas.ts:60:13)apps/diffinery test:     at mayStart (/workspace/diffinery/apps/diffinery/src/lib/quotas.ts:191:19)apps/diffinery test:     at Actions.admit (/workspace/diffinery/apps/diffinery/src/repo/actions.ts:1307:25)apps/diffinery test:     at Actions.launch (/workspace/diffinery/apps/diffinery/src/repo/actions.ts:1238:23)apps/diffinery test:     at /workspace/diffinery/apps/diffinery/test/unit/actions-runtime.test.ts:719:41apps/diffinery test:     at async file:///workspace/diffinery/node_modules/.pnpm/@vitest+runner@4.1.11/node_modules/@vitest/runner/dist/chunk-artifact.js:1903:20apps/diffinery test: stderr | test/unit/actions-runtime.test.ts > hosted runner slots > a repository runs at most SHARE hosted jobs at once; the rest wait their turnapps/diffinery test: compute usage failed TypeError: Cannot read properties of undefined (reading 'prepare')apps/diffinery test:     at startCompute (/workspace/diffinery/apps/diffinery/src/lib/quotas.ts:213:16)apps/diffinery test:     at Actions.admit (/workspace/diffinery/apps/diffinery/src/repo/actions.ts:1322:11)apps/diffinery test:     at Actions.launch (/workspace/diffinery/apps/diffinery/src/repo/actions.ts:1238:23)apps/diffinery test:     at /workspace/diffinery/apps/diffinery/test/unit/actions-runtime.test.ts:719:41apps/diffinery test:     at async file:///workspace/diffinery/node_modules/.pnpm/@vitest+runner@4.1.11/node_modules/@vitest/runner/dist/chunk-artifact.js:1903:20apps/diffinery test: stderr | test/unit/actions-runtime.test.ts > hosted runner slots > a repository runs at most SHARE hosted jobs at once; the rest wait their turnapps/diffinery test: kill switch check failed TypeError: Cannot read properties of undefined (reading 'prepare')apps/diffinery test:     at killSwitches (/workspace/diffinery/apps/diffinery/src/lib/killswitch.ts:46:26)apps/diffinery test:     at Actions.blocked (/workspace/diffinery/apps/diffinery/src/repo/actions.ts:2932:30)apps/diffinery test:     at Actions.admit (/workspace/diffinery/apps/diffinery/src/repo/actions.ts:1284:30)apps/diffinery test:     at Actions.launch (/workspace/diffinery/apps/diffinery/src/repo/actions.ts:1238:34)apps/diffinery test:     at launch (/workspace/diffinery/apps/diffinery/test/unit/actions-runtime.test.ts:718:98)apps/diffinery test:     at /workspace/diffinery/apps/diffinery/test/unit/actions-runtime.test.ts:719:47apps/diffinery test:     at async file:///workspace/diffinery/node_modules/.pnpm/@vitest+runner@4.1.11/node_modules/@vitest/runner/dist/chunk-artifact.js:1903:20apps/diffinery test: stderr | test/unit/actions-runtime.test.ts > hosted runner slots > a repository runs at most SHARE hosted jobs at once; the rest wait their turnapps/diffinery test: quota check failed TypeError: Cannot read properties of undefined (reading 'prepare')apps/diffinery test:     at adminRun (/workspace/diffinery/apps/diffinery/src/lib/quotas.ts:50:26)apps/diffinery test:     at quotasFor (/workspace/diffinery/apps/diffinery/src/lib/quotas.ts:60:13)apps/diffinery test:     at mayStart (/workspace/diffinery/apps/diffinery/src/lib/quotas.ts:191:19)apps/diffinery test:     at Actions.admit (/workspace/diffinery/apps/diffinery/src/repo/actions.ts:1307:25)apps/diffinery test:     at Actions.launch (/workspace/diffinery/apps/diffinery/src/repo/actions.ts:1238:23)apps/diffinery test:     at /workspace/diffinery/apps/diffinery/test/unit/actions-runtime.test.ts:719:41apps/diffinery test:     at async file:///workspace/diffinery/node_modules/.pnpm/@vitest+runner@4.1.11/node_modules/@vitest/runner/dist/chunk-artifact.js:1903:20apps/diffinery test: stderr | test/unit/actions-runtime.test.ts > hosted runner slots > a repository runs at most SHARE hosted jobs at once; the rest wait their turnapps/diffinery test: compute usage failed TypeError: Cannot read properties of undefined (reading 'prepare')apps/diffinery test:     at startCompute (/workspace/diffinery/apps/diffinery/src/lib/quotas.ts:213:16)apps/diffinery test:     at Actions.admit (/workspace/diffinery/apps/diffinery/src/repo/actions.ts:1322:11)apps/diffinery test:     at Actions.launch (/workspace/diffinery/apps/diffinery/src/repo/actions.ts:1238:23)apps/diffinery test:     at /workspace/diffinery/apps/diffinery/test/unit/actions-runtime.test.ts:719:41apps/diffinery test:     at async file:///workspace/diffinery/node_modules/.pnpm/@vitest+runner@4.1.11/node_modules/@vitest/runner/dist/chunk-artifact.js:1903:20apps/diffinery test: stderr | test/unit/actions-runtime.test.ts > hosted runner slots > a repository runs at most SHARE hosted jobs at once; the rest wait their turnapps/diffinery test: kill switch check failed TypeError: Cannot read properties of undefined (reading 'prepare')apps/diffinery test:     at killSwitches (/workspace/diffinery/apps/diffinery/src/lib/killswitch.ts:46:26)apps/diffinery test:     at Actions.blocked (/workspace/diffinery/apps/diffinery/src/repo/actions.ts:2932:30)apps/diffinery test:     at Actions.admit (/workspace/diffinery/apps/diffinery/src/repo/actions.ts:1284:30)apps/diffinery test:     at Actions.launch (/workspace/diffinery/apps/diffinery/src/repo/actions.ts:1238:34)apps/diffinery test:     at launch (/workspace/diffinery/apps/diffinery/test/unit/actions-runtime.test.ts:718:98)apps/diffinery test:     at /workspace/diffinery/apps/diffinery/test/unit/actions-runtime.test.ts:719:47apps/diffinery test:     at async file:///workspace/diffinery/node_modules/.pnpm/@vitest+runner@4.1.11/node_modules/@vitest/runner/dist/chunk-artifact.js:1903:20apps/diffinery test: stderr | test/unit/actions-runtime.test.ts > hosted runner slots > a repository runs at most SHARE hosted jobs at once; the rest wait their turnapps/diffinery test: quota check failed TypeError: Cannot read properties of undefined (reading 'prepare')apps/diffinery test:     at adminRun (/workspace/diffinery/apps/diffinery/src/lib/quotas.ts:50:26)apps/diffinery test:     at quotasFor (/workspace/diffinery/apps/diffinery/src/lib/quotas.ts:60:13)apps/diffinery test:     at mayStart (/workspace/diffinery/apps/diffinery/src/lib/quotas.ts:191:19)apps/diffinery test:     at Actions.admit (/workspace/diffinery/apps/diffinery/src/repo/actions.ts:1307:25)apps/diffinery test:     at Actions.launch (/workspace/diffinery/apps/diffinery/src/repo/actions.ts:1238:23)apps/diffinery test:     at /workspace/diffinery/apps/diffinery/test/unit/actions-runtime.test.ts:719:41apps/diffinery test:     at async file:///workspace/diffinery/node_modules/.pnpm/@vitest+runner@4.1.11/node_modules/@vitest/runner/dist/chunk-artifact.js:1903:20apps/diffinery test: stderr | test/unit/actions-runtime.test.ts > hosted runner slots > a repository runs at most SHARE hosted jobs at once; the rest wait their turnapps/diffinery test: compute usage failed TypeError: Cannot read properties of undefined (reading 'prepare')apps/diffinery test:     at startCompute (/workspace/diffinery/apps/diffinery/src/lib/quotas.ts:213:16)apps/diffinery test:     at Actions.admit (/workspace/diffinery/apps/diffinery/src/repo/actions.ts:1322:11)apps/diffinery test:     at Actions.launch (/workspace/diffinery/apps/diffinery/src/repo/actions.ts:1238:23)apps/diffinery test:     at /workspace/diffinery/apps/diffinery/test/unit/actions-runtime.test.ts:719:41apps/diffinery test:     at async file:///workspace/diffinery/node_modules/.pnpm/@vitest+runner@4.1.11/node_modules/@vitest/runner/dist/chunk-artifact.js:1903:20apps/diffinery test: stderr | test/unit/actions-runtime.test.ts > hosted runner slots > a repository runs at most SHARE hosted jobs at once; the rest wait their turnapps/diffinery test: kill switch check failed TypeError: Cannot read properties of undefined (reading 'prepare')apps/diffinery test:     at killSwitches (/workspace/diffinery/apps/diffinery/src/lib/killswitch.ts:46:26)apps/diffinery test:     at Actions.blocked (/workspace/diffinery/apps/diffinery/src/repo/actions.ts:2932:30)apps/diffinery test:     at Actions.admit (/workspace/diffinery/apps/diffinery/src/repo/actions.ts:1284:30)apps/diffinery test:     at Actions.launch (/workspace/diffinery/apps/diffinery/src/repo/actions.ts:1238:34)apps/diffinery test:     at launch (/workspace/diffinery/apps/diffinery/test/unit/actions-runtime.test.ts:718:98)apps/diffinery test:     at /workspace/diffinery/apps/diffinery/test/unit/actions-runtime.test.ts:719:47apps/diffinery test:     at async file:///workspace/diffinery/node_modules/.pnpm/@vitest+runner@4.1.11/node_modules/@vitest/runner/dist/chunk-artifact.js:1903:20apps/diffinery test: stderr | test/unit/actions-runtime.test.ts > hosted runner slots > a repository runs at most SHARE hosted jobs at once; the rest wait their turnapps/diffinery test: quota check failed TypeError: Cannot read properties of undefined (reading 'prepare')apps/diffinery test:     at adminRun (/workspace/diffinery/apps/diffinery/src/lib/quotas.ts:50:26)apps/diffinery test:     at quotasFor (/workspace/diffinery/apps/diffinery/src/lib/quotas.ts:60:13)apps/diffinery test:     at mayStart (/workspace/diffinery/apps/diffinery/src/lib/quotas.ts:191:19)apps/diffinery test:     at Actions.admit (/workspace/diffinery/apps/diffinery/src/repo/actions.ts:1307:25)apps/diffinery test:     at Actions.launch (/workspace/diffinery/apps/diffinery/src/repo/actions.ts:1238:23)apps/diffinery test:     at /workspace/diffinery/apps/diffinery/test/unit/actions-runtime.test.ts:719:41apps/diffinery test:     at async file:///workspace/diffinery/node_modules/.pnpm/@vitest+runner@4.1.11/node_modules/@vitest/runner/dist/chunk-artifact.js:1903:20apps/diffinery test: stderr | test/unit/actions-runtime.test.ts > hosted runner slots > a repository runs at most SHARE hosted jobs at once; the rest wait their turnapps/diffinery test: compute usage failed TypeError: Cannot read properties of undefined (reading 'prepare')apps/diffinery test:     at startCompute (/workspace/diffinery/apps/diffinery/src/lib/quotas.ts:213:16)apps/diffinery test:     at Actions.admit (/workspace/diffinery/apps/diffinery/src/repo/actions.ts:1322:11)apps/diffinery test:     at Actions.launch (/workspace/diffinery/apps/diffinery/src/repo/actions.ts:1238:23)apps/diffinery test:     at /workspace/diffinery/apps/diffinery/test/unit/actions-runtime.test.ts:719:41apps/diffinery test:     at async file:///workspace/diffinery/node_modules/.pnpm/@vitest+runner@4.1.11/node_modules/@vitest/runner/dist/chunk-artifact.js:1903:20apps/diffinery test: stderr | test/unit/actions-runtime.test.ts > hosted runner slots > a repository runs at most SHARE hosted jobs at once; the rest wait their turnapps/diffinery test: kill switch check failed TypeError: Cannot read properties of undefined (reading 'prepare')apps/diffinery test:     at killSwitches (/workspace/diffinery/apps/diffinery/src/lib/killswitch.ts:46:26)apps/diffinery test:     at Actions.blocked (/workspace/diffinery/apps/diffinery/src/repo/actions.ts:2932:30)apps/diffinery test:     at Actions.admit (/workspace/diffinery/apps/diffinery/src/repo/actions.ts:1284:30)apps/diffinery test:     at Actions.launch (/workspace/diffinery/apps/diffinery/src/repo/actions.ts:1238:34)apps/diffinery test:     at launch (/workspace/diffinery/apps/diffinery/test/unit/actions-runtime.test.ts:718:98)apps/diffinery test:     at /workspace/diffinery/apps/diffinery/test/unit/actions-runtime.test.ts:719:47apps/diffinery test:     at async file:///workspace/diffinery/node_modules/.pnpm/@vitest+runner@4.1.11/node_modules/@vitest/runner/dist/chunk-artifact.js:1903:20apps/diffinery test: stderr | test/unit/actions-runtime.test.ts > hosted runner slots > a repository runs at most SHARE hosted jobs at once; the rest wait their turnapps/diffinery test: quota check failed TypeError: Cannot read properties of undefined (reading 'prepare')apps/diffinery test:     at adminRun (/workspace/diffinery/apps/diffinery/src/lib/quotas.ts:50:26)apps/diffinery test:     at quotasFor (/workspace/diffinery/apps/diffinery/src/lib/quotas.ts:60:13)apps/diffinery test:     at mayStart (/workspace/diffinery/apps/diffinery/src/lib/quotas.ts:191:19)apps/diffinery test:     at Actions.admit (/workspace/diffinery/apps/diffinery/src/repo/actions.ts:1307:25)apps/diffinery test:     at Actions.launch (/workspace/diffinery/apps/diffinery/src/repo/actions.ts:1238:23)apps/diffinery test:     at /workspace/diffinery/apps/diffinery/test/unit/actions-runtime.test.ts:719:41apps/diffinery test:     at async file:///workspace/diffinery/node_modules/.pnpm/@vitest+runner@4.1.11/node_modules/@vitest/runner/dist/chunk-artifact.js:1903:20apps/diffinery test: stderr | test/unit/actions-runtime.test.ts > hosted runner slots > a repository runs at most SHARE hosted jobs at once; the rest wait their turnapps/diffinery test: compute usage failed TypeError: Cannot read properties of undefined (reading 'prepare')apps/diffinery test:     at startCompute (/workspace/diffinery/apps/diffinery/src/lib/quotas.ts:213:16)apps/diffinery test:     at Actions.admit (/workspace/diffinery/apps/diffinery/src/repo/actions.ts:1322:11)apps/diffinery test:     at Actions.launch (/workspace/diffinery/apps/diffinery/src/repo/actions.ts:1238:23)apps/diffinery test:     at /workspace/diffinery/apps/diffinery/test/unit/actions-runtime.test.ts:719:41apps/diffinery test:     at async file:///workspace/diffinery/node_modules/.pnpm/@vitest+runner@4.1.11/node_modules/@vitest/runner/dist/chunk-artifact.js:1903:20apps/diffinery test: stderr | test/unit/actions-runtime.test.ts > hosted runner slots > a repository runs at most SHARE hosted jobs at once; the rest wait their turnapps/diffinery test: kill switch check failed TypeError: Cannot read properties of undefined (reading 'prepare')apps/diffinery test:     at killSwitches (/workspace/diffinery/apps/diffinery/src/lib/killswitch.ts:46:26)apps/diffinery test:     at Actions.blocked (/workspace/diffinery/apps/diffinery/src/repo/actions.ts:2932:30)apps/diffinery test:     at Actions.admit (/workspace/diffinery/apps/diffinery/src/repo/actions.ts:1284:30)apps/diffinery test:     at Actions.launch (/workspace/diffinery/apps/diffinery/src/repo/actions.ts:1238:34)apps/diffinery test:     at launch (/workspace/diffinery/apps/diffinery/test/unit/actions-runtime.test.ts:718:98)apps/diffinery test:     at /workspace/diffinery/apps/diffinery/test/unit/actions-runtime.test.ts:719:47apps/diffinery test:     at async file:///workspace/diffinery/node_modules/.pnpm/@vitest+runner@4.1.11/node_modules/@vitest/runner/dist/chunk-artifact.js:1903:20apps/diffinery test: stderr | test/unit/actions-runtime.test.ts > hosted runner slots > a repository runs at most SHARE hosted jobs at once; the rest wait their turnapps/diffinery test: quota check failed TypeError: Cannot read properties of undefined (reading 'prepare')apps/diffinery test:     at adminRun (/workspace/diffinery/apps/diffinery/src/lib/quotas.ts:50:26)apps/diffinery test:     at quotasFor (/workspace/diffinery/apps/diffinery/src/lib/quotas.ts:60:13)apps/diffinery test:     at mayStart (/workspace/diffinery/apps/diffinery/src/lib/quotas.ts:191:19)apps/diffinery test:     at Actions.admit (/workspace/diffinery/apps/diffinery/src/repo/actions.ts:1307:25)apps/diffinery test:     at Actions.launch (/workspace/diffinery/apps/diffinery/src/repo/actions.ts:1238:23)apps/diffinery test:     at /workspace/diffinery/apps/diffinery/test/unit/actions-runtime.test.ts:719:41apps/diffinery test:     at async file:///workspace/diffinery/node_modules/.pnpm/@vitest+runner@4.1.11/node_modules/@vitest/runner/dist/chunk-artifact.js:1903:20apps/diffinery test: stderr | test/unit/actions-runtime.test.ts > hosted runner slots > a repository runs at most SHARE hosted jobs at once; the rest wait their turnapps/diffinery test: compute usage failed TypeError: Cannot read properties of undefined (reading 'prepare')apps/diffinery test:     at startCompute (/workspace/diffinery/apps/diffinery/src/lib/quotas.ts:213:16)apps/diffinery test:     at Actions.admit (/workspace/diffinery/apps/diffinery/src/repo/actions.ts:1322:11)apps/diffinery test:     at Actions.launch (/workspace/diffinery/apps/diffinery/src/repo/actions.ts:1238:23)apps/diffinery test:     at /workspace/diffinery/apps/diffinery/test/unit/actions-runtime.test.ts:719:41apps/diffinery test:     at async file:///workspace/diffinery/node_modules/.pnpm/@vitest+runner@4.1.11/node_modules/@vitest/runner/dist/chunk-artifact.js:1903:20apps/diffinery test: stderr | test/unit/actions-runtime.test.ts > hosted runner slots > a repository runs at most SHARE hosted jobs at once; the rest wait their turnapps/diffinery test: kill switch check failed TypeError: Cannot read properties of undefined (reading 'prepare')apps/diffinery test:     at killSwitches (/workspace/diffinery/apps/diffinery/src/lib/killswitch.ts:46:26)apps/diffinery test:     at Actions.blocked (/workspace/diffinery/apps/diffinery/src/repo/actions.ts:2932:30)apps/diffinery test:     at Actions.admit (/workspace/diffinery/apps/diffinery/src/repo/actions.ts:1284:30)apps/diffinery test:     at Actions.launch (/workspace/diffinery/apps/diffinery/src/repo/actions.ts:1238:34)apps/diffinery test:     at launch (/workspace/diffinery/apps/diffinery/test/unit/actions-runtime.test.ts:718:98)apps/diffinery test:     at /workspace/diffinery/apps/diffinery/test/unit/actions-runtime.test.ts:719:47apps/diffinery test:     at async file:///workspace/diffinery/node_modules/.pnpm/@vitest+runner@4.1.11/node_modules/@vitest/runner/dist/chunk-artifact.js:1903:20apps/diffinery test: stderr | test/unit/actions-runtime.test.ts > hosted runner slots > a repository runs at most SHARE hosted jobs at once; the rest wait their turnapps/diffinery test: quota check failed TypeError: Cannot read properties of undefined (reading 'prepare')apps/diffinery test:     at adminRun (/workspace/diffinery/apps/diffinery/src/lib/quotas.ts:50:26)apps/diffinery test:     at quotasFor (/workspace/diffinery/apps/diffinery/src/lib/quotas.ts:60:13)apps/diffinery test:     at mayStart (/workspace/diffinery/apps/diffinery/src/lib/quotas.ts:191:19)apps/diffinery test:     at Actions.admit (/workspace/diffinery/apps/diffinery/src/repo/actions.ts:1307:25)apps/diffinery test:     at Actions.launch (/workspace/diffinery/apps/diffinery/src/repo/actions.ts:1238:23)apps/diffinery test:     at /workspace/diffinery/apps/diffinery/test/unit/actions-runtime.test.ts:719:41apps/diffinery test:     at async file:///workspace/diffinery/node_modules/.pnpm/@vitest+runner@4.1.11/node_modules/@vitest/runner/dist/chunk-artifact.js:1903:20apps/diffinery test: stderr | test/unit/actions-runtime.test.ts > hosted runner slots > a repository runs at most SHARE hosted jobs at once; the rest wait their turnapps/diffinery test: compute usage failed TypeError: Cannot read properties of undefined (reading 'prepare')apps/diffinery test:     at startCompute (/workspace/diffinery/apps/diffinery/src/lib/quotas.ts:213:16)apps/diffinery test:     at Actions.admit (/workspace/diffinery/apps/diffinery/src/repo/actions.ts:1322:11)apps/diffinery test:     at Actions.launch (/workspace/diffinery/apps/diffinery/src/repo/actions.ts:1238:23)apps/diffinery test:     at /workspace/diffinery/apps/diffinery/test/unit/actions-runtime.test.ts:719:41apps/diffinery test:     at async file:///workspace/diffinery/node_modules/.pnpm/@vitest+runner@4.1.11/node_modules/@vitest/runner/dist/chunk-artifact.js:1903:20apps/diffinery test: stderr | test/unit/actions-runtime.test.ts > hosted runner slots > a repository runs at most SHARE hosted jobs at once; the rest wait their turnapps/diffinery test: kill switch check failed TypeError: Cannot read properties of undefined (reading 'prepare')apps/diffinery test:     at killSwitches (/workspace/diffinery/apps/diffinery/src/lib/killswitch.ts:46:26)apps/diffinery test:     at Actions.blocked (/workspace/diffinery/apps/diffinery/src/repo/actions.ts:2932:30)apps/diffinery test:     at Actions.admit (/workspace/diffinery/apps/diffinery/src/repo/actions.ts:1284:30)apps/diffinery test:     at Actions.launch (/workspace/diffinery/apps/diffinery/src/repo/actions.ts:1238:34)apps/diffinery test:     at launch (/workspace/diffinery/apps/diffinery/test/unit/actions-runtime.test.ts:718:98)apps/diffinery test:     at /workspace/diffinery/apps/diffinery/test/unit/actions-runtime.test.ts:719:47apps/diffinery test:     at async file:///workspace/diffinery/node_modules/.pnpm/@vitest+runner@4.1.11/node_modules/@vitest/runner/dist/chunk-artifact.js:1903:20apps/diffinery test: stderr | test/unit/actions-runtime.test.ts > hosted runner slots > a repository runs at most SHARE hosted jobs at once; the rest wait their turnapps/diffinery test: quota check failed TypeError: Cannot read properties of undefined (reading 'prepare')apps/diffinery test:     at adminRun (/workspace/diffinery/apps/diffinery/src/lib/quotas.ts:50:26)apps/diffinery test:     at quotasFor (/workspace/diffinery/apps/diffinery/src/lib/quotas.ts:60:13)apps/diffinery test:     at mayStart (/workspace/diffinery/apps/diffinery/src/lib/quotas.ts:191:19)apps/diffinery test:     at Actions.admit (/workspace/diffinery/apps/diffinery/src/repo/actions.ts:1307:25)apps/diffinery test:     at Actions.launch (/workspace/diffinery/apps/diffinery/src/repo/actions.ts:1238:23)apps/diffinery test:     at /workspace/diffinery/apps/diffinery/test/unit/actions-runtime.test.ts:719:41apps/diffinery test:     at async file:///workspace/diffinery/node_modules/.pnpm/@vitest+runner@4.1.11/node_modules/@vitest/runner/dist/chunk-artifact.js:1903:20apps/diffinery test: stderr | test/unit/actions-runtime.test.ts > hosted runner slots > a repository runs at most SHARE hosted jobs at once; the rest wait their turnapps/diffinery test: compute usage failed TypeError: Cannot read properties of undefined (reading 'prepare')apps/diffinery test:     at startCompute (/workspace/diffinery/apps/diffinery/src/lib/quotas.ts:213:16)apps/diffinery test:     at Actions.admit (/workspace/diffinery/apps/diffinery/src/repo/actions.ts:1322:11)apps/diffinery test:     at Actions.launch (/workspace/diffinery/apps/diffinery/src/repo/actions.ts:1238:23)apps/diffinery test:     at /workspace/diffinery/apps/diffinery/test/unit/actions-runtime.test.ts:719:41apps/diffinery test:     at async file:///workspace/diffinery/node_modules/.pnpm/@vitest+runner@4.1.11/node_modules/@vitest/runner/dist/chunk-artifact.js:1903:20apps/diffinery test: stderr | test/unit/actions-runtime.test.ts > hosted runner slots > a repository runs at most SHARE hosted jobs at once; the rest wait their turnapps/diffinery test: kill switch check failed TypeError: Cannot read properties of undefined (reading 'prepare')apps/diffinery test:     at killSwitches (/workspace/diffinery/apps/diffinery/src/lib/killswitch.ts:46:26)apps/diffinery test:     at Actions.blocked (/workspace/diffinery/apps/diffinery/src/repo/actions.ts:2932:30)apps/diffinery test:     at Actions.admit (/workspace/diffinery/apps/diffinery/src/repo/actions.ts:1284:30)apps/diffinery test:     at Actions.launch (/workspace/diffinery/apps/diffinery/src/repo/actions.ts:1238:34)apps/diffinery test:     at launch (/workspace/diffinery/apps/diffinery/test/unit/actions-runtime.test.ts:718:98)apps/diffinery test:     at /workspace/diffinery/apps/diffinery/test/unit/actions-runtime.test.ts:719:47apps/diffinery test:     at async file:///workspace/diffinery/node_modules/.pnpm/@vitest+runner@4.1.11/node_modules/@vitest/runner/dist/chunk-artifact.js:1903:20apps/diffinery test: stderr | test/unit/actions-runtime.test.ts > hosted runner slots > a repository runs at most SHARE hosted jobs at once; the rest wait their turnapps/diffinery test: quota check failed TypeError: Cannot read properties of undefined (reading 'prepare')apps/diffinery test:     at adminRun (/workspace/diffinery/apps/diffinery/src/lib/quotas.ts:50:26)apps/diffinery test:     at quotasFor (/workspace/diffinery/apps/diffinery/src/lib/quotas.ts:60:13)apps/diffinery test:     at mayStart (/workspace/diffinery/apps/diffinery/src/lib/quotas.ts:191:19)apps/diffinery test:     at Actions.admit (/workspace/diffinery/apps/diffinery/src/repo/actions.ts:1307:25)apps/diffinery test:     at Actions.launch (/workspace/diffinery/apps/diffinery/src/repo/actions.ts:1238:23)apps/diffinery test:     at /workspace/diffinery/apps/diffinery/test/unit/actions-runtime.test.ts:719:41apps/diffinery test:     at async file:///workspace/diffinery/node_modules/.pnpm/@vitest+runner@4.1.11/node_modules/@vitest/runner/dist/chunk-artifact.js:1903:20apps/diffinery test: stderr | test/unit/actions-runtime.test.ts > hosted runner slots > a repository runs at most SHARE hosted jobs at once; the rest wait their turnapps/diffinery test: compute usage failed TypeError: Cannot read properties of undefined (reading 'prepare')apps/diffinery test:     at startCompute (/workspace/diffinery/apps/diffinery/src/lib/quotas.ts:213:16)apps/diffinery test:     at Actions.admit (/workspace/diffinery/apps/diffinery/src/repo/actions.ts:1322:11)apps/diffinery test:     at Actions.launch (/workspace/diffinery/apps/diffinery/src/repo/actions.ts:1238:23)apps/diffinery test:     at /workspace/diffinery/apps/diffinery/test/unit/actions-runtime.test.ts:719:41apps/diffinery test:     at async file:///workspace/diffinery/node_modules/.pnpm/@vitest+runner@4.1.11/node_modules/@vitest/runner/dist/chunk-artifact.js:1903:20apps/diffinery test: stderr | test/unit/actions-runtime.test.ts > hosted runner slots > a repository runs at most SHARE hosted jobs at once; the rest wait their turnapps/diffinery test: kill switch check failed TypeError: Cannot read properties of undefined (reading 'prepare')apps/diffinery test:     at killSwitches (/workspace/diffinery/apps/diffinery/src/lib/killswitch.ts:46:26)apps/diffinery test:     at Actions.blocked (/workspace/diffinery/apps/diffinery/src/repo/actions.ts:2932:30)apps/diffinery test:     at Actions.admit (/workspace/diffinery/apps/diffinery/src/repo/actions.ts:1284:30)apps/diffinery test:     at Actions.launch (/workspace/diffinery/apps/diffinery/src/repo/actions.ts:1238:34)apps/diffinery test:     at launch (/workspace/diffinery/apps/diffinery/test/unit/actions-runtime.test.ts:718:98)apps/diffinery test:     at /workspace/diffinery/apps/diffinery/test/unit/actions-runtime.test.ts:719:47apps/diffinery test:     at async file:///workspace/diffinery/node_modules/.pnpm/@vitest+runner@4.1.11/node_modules/@vitest/runner/dist/chunk-artifact.js:1903:20apps/diffinery test: stderr | test/unit/actions-runtime.test.ts > hosted runner slots > a repository runs at most SHARE hosted jobs at once; the rest wait their turnapps/diffinery test: quota check failed TypeError: Cannot read properties of undefined (reading 'prepare')apps/diffinery test:     at adminRun (/workspace/diffinery/apps/diffinery/src/lib/quotas.ts:50:26)apps/diffinery test:     at quotasFor (/workspace/diffinery/apps/diffinery/src/lib/quotas.ts:60:13)apps/diffinery test:     at mayStart (/workspace/diffinery/apps/diffinery/src/lib/quotas.ts:191:19)apps/diffinery test:     at Actions.admit (/workspace/diffinery/apps/diffinery/src/repo/actions.ts:1307:25)apps/diffinery test:     at Actions.launch (/workspace/diffinery/apps/diffinery/src/repo/actions.ts:1238:23)apps/diffinery test:     at /workspace/diffinery/apps/diffinery/test/unit/actions-runtime.test.ts:719:41apps/diffinery test:     at async file:///workspace/diffinery/node_modules/.pnpm/@vitest+runner@4.1.11/node_modules/@vitest/runner/dist/chunk-artifact.js:1903:20apps/diffinery test: stderr | test/unit/actions-runtime.test.ts > hosted runner slots > a repository runs at most SHARE hosted jobs at once; the rest wait their turnapps/diffinery test: compute usage failed TypeError: Cannot read properties of undefined (reading 'prepare')apps/diffinery test:     at startCompute (/workspace/diffinery/apps/diffinery/src/lib/quotas.ts:213:16)apps/diffinery test:     at Actions.admit (/workspace/diffinery/apps/diffinery/src/repo/actions.ts:1322:11)apps/diffinery test:     at Actions.launch (/workspace/diffinery/apps/diffinery/src/repo/actions.ts:1238:23)apps/diffinery test:     at /workspace/diffinery/apps/diffinery/test/unit/actions-runtime.test.ts:719:41apps/diffinery test:     at async file:///workspace/diffinery/node_modules/.pnpm/@vitest+runner@4.1.11/node_modules/@vitest/runner/dist/chunk-artifact.js:1903:20apps/diffinery test: stderr | test/unit/actions-runtime.test.ts > hosted runner slots > a repository runs at most SHARE hosted jobs at once; the rest wait their turnapps/diffinery test: kill switch check failed TypeError: Cannot read properties of undefined (reading 'prepare')apps/diffinery test:     at killSwitches (/workspace/diffinery/apps/diffinery/src/lib/killswitch.ts:46:26)apps/diffinery test:     at Actions.blocked (/workspace/diffinery/apps/diffinery/src/repo/actions.ts:2932:30)apps/diffinery test:     at Actions.admit (/workspace/diffinery/apps/diffinery/src/repo/actions.ts:1284:30)apps/diffinery test:     at Actions.launch (/workspace/diffinery/apps/diffinery/src/repo/actions.ts:1238:34)apps/diffinery test:     at launch (/workspace/diffinery/apps/diffinery/test/unit/actions-runtime.test.ts:718:98)apps/diffinery test:     at /workspace/diffinery/apps/diffinery/test/unit/actions-runtime.test.ts:719:47apps/diffinery test:     at async file:///workspace/diffinery/node_modules/.pnpm/@vitest+runner@4.1.11/node_modules/@vitest/runner/dist/chunk-artifact.js:1903:20apps/diffinery test: stderr | test/unit/actions-runtime.test.ts > hosted runner slots > a repository runs at most SHARE hosted jobs at once; the rest wait their turnapps/diffinery test: quota check failed TypeError: Cannot read properties of undefined (reading 'prepare')apps/diffinery test:     at adminRun (/workspace/diffinery/apps/diffinery/src/lib/quotas.ts:50:26)apps/diffinery test:     at quotasFor (/workspace/diffinery/apps/diffinery/src/lib/quotas.ts:60:13)apps/diffinery test:     at mayStart (/workspace/diffinery/apps/diffinery/src/lib/quotas.ts:191:19)apps/diffinery test:     at Actions.admit (/workspace/diffinery/apps/diffinery/src/repo/actions.ts:1307:25)apps/diffinery test:     at Actions.launch (/workspace/diffinery/apps/diffinery/src/repo/actions.ts:1238:23)apps/diffinery test:     at /workspace/diffinery/apps/diffinery/test/unit/actions-runtime.test.ts:719:41apps/diffinery test:     at async file:///workspace/diffinery/node_modules/.pnpm/@vitest+runner@4.1.11/node_modules/@vitest/runner/dist/chunk-artifact.js:1903:20apps/diffinery test: stderr | test/unit/actions-runtime.test.ts > hosted runner slots > a repository runs at most SHARE hosted jobs at once; the rest wait their turnapps/diffinery test: compute usage failed TypeError: Cannot read properties of undefined (reading 'prepare')apps/diffinery test:     at startCompute (/workspace/diffinery/apps/diffinery/src/lib/quotas.ts:213:16)apps/diffinery test:     at Actions.admit (/workspace/diffinery/apps/diffinery/src/repo/actions.ts:1322:11)apps/diffinery test:     at Actions.launch (/workspace/diffinery/apps/diffinery/src/repo/actions.ts:1238:23)apps/diffinery test:     at /workspace/diffinery/apps/diffinery/test/unit/actions-runtime.test.ts:719:41apps/diffinery test:     at async file:///workspace/diffinery/node_modules/.pnpm/@vitest+runner@4.1.11/node_modules/@vitest/runner/dist/chunk-artifact.js:1903:20apps/diffinery test: stderr | test/unit/actions-runtime.test.ts > hosted runner slots > a repository runs at most SHARE hosted jobs at once; the rest wait their turnapps/diffinery test: kill switch check failed TypeError: Cannot read properties of undefined (reading 'prepare')apps/diffinery test:     at killSwitches (/workspace/diffinery/apps/diffinery/src/lib/killswitch.ts:46:26)apps/diffinery test:     at Actions.blocked (/workspace/diffinery/apps/diffinery/src/repo/actions.ts:2932:30)apps/diffinery test:     at Actions.admit (/workspace/diffinery/apps/diffinery/src/repo/actions.ts:1284:30)apps/diffinery test:     at Actions.launch (/workspace/diffinery/apps/diffinery/src/repo/actions.ts:1238:34)apps/diffinery test:     at launch (/workspace/diffinery/apps/diffinery/test/unit/actions-runtime.test.ts:718:98)apps/diffinery test:     at /workspace/diffinery/apps/diffinery/test/unit/actions-runtime.test.ts:719:47apps/diffinery test:     at async file:///workspace/diffinery/node_modules/.pnpm/@vitest+runner@4.1.11/node_modules/@vitest/runner/dist/chunk-artifact.js:1903:20apps/diffinery test: stderr | test/unit/actions-runtime.test.ts > hosted runner slots > a repository runs at most SHARE hosted jobs at once; the rest wait their turnapps/diffinery test: quota check failed TypeError: Cannot read properties of undefined (reading 'prepare')apps/diffinery test:     at adminRun (/workspace/diffinery/apps/diffinery/src/lib/quotas.ts:50:26)apps/diffinery test:     at quotasFor (/workspace/diffinery/apps/diffinery/src/lib/quotas.ts:60:13)apps/diffinery test:     at mayStart (/workspace/diffinery/apps/diffinery/src/lib/quotas.ts:191:19)apps/diffinery test:     at Actions.admit (/workspace/diffinery/apps/diffinery/src/repo/actions.ts:1307:25)apps/diffinery test:     at Actions.launch (/workspace/diffinery/apps/diffinery/src/repo/actions.ts:1238:23)apps/diffinery test:     at /workspace/diffinery/apps/diffinery/test/unit/actions-runtime.test.ts:719:41apps/diffinery test:     at async file:///workspace/diffinery/node_modules/.pnpm/@vitest+runner@4.1.11/node_modules/@vitest/runner/dist/chunk-artifact.js:1903:20apps/diffinery test: stderr | test/unit/actions-runtime.test.ts > hosted runner slots > a repository runs at most SHARE hosted jobs at once; the rest wait their turnapps/diffinery test: compute usage failed TypeError: Cannot read properties of undefined (reading 'prepare')apps/diffinery test:     at startCompute (/workspace/diffinery/apps/diffinery/src/lib/quotas.ts:213:16)apps/diffinery test:     at Actions.admit (/workspace/diffinery/apps/diffinery/src/repo/actions.ts:1322:11)apps/diffinery test:     at Actions.launch (/workspace/diffinery/apps/diffinery/src/repo/actions.ts:1238:23)apps/diffinery test:     at /workspace/diffinery/apps/diffinery/test/unit/actions-runtime.test.ts:719:41apps/diffinery test:     at async file:///workspace/diffinery/node_modules/.pnpm/@vitest+runner@4.1.11/node_modules/@vitest/runner/dist/chunk-artifact.js:1903:20apps/diffinery test: stderr | test/unit/actions-runtime.test.ts > hosted runner slots > a repository runs at most SHARE hosted jobs at once; the rest wait their turnapps/diffinery test: kill switch check failed TypeError: Cannot read properties of undefined (reading 'prepare')apps/diffinery test:     at killSwitches (/workspace/diffinery/apps/diffinery/src/lib/killswitch.ts:46:26)apps/diffinery test:     at Actions.blocked (/workspace/diffinery/apps/diffinery/src/repo/actions.ts:2932:30)apps/diffinery test:     at Actions.admit (/workspace/diffinery/apps/diffinery/src/repo/actions.ts:1284:30)apps/diffinery test:     at Actions.launch (/workspace/diffinery/apps/diffinery/src/repo/actions.ts:1238:34)apps/diffinery test:     at launch (/workspace/diffinery/apps/diffinery/test/unit/actions-runtime.test.ts:718:98)apps/diffinery test:     at /workspace/diffinery/apps/diffinery/test/unit/actions-runtime.test.ts:719:47apps/diffinery test:     at async file:///workspace/diffinery/node_modules/.pnpm/@vitest+runner@4.1.11/node_modules/@vitest/runner/dist/chunk-artifact.js:1903:20apps/diffinery test: stderr | test/unit/actions-runtime.test.ts > hosted runner slots > a repository runs at most SHARE hosted jobs at once; the rest wait their turnapps/diffinery test: quota check failed TypeError: Cannot read properties of undefined (reading 'prepare')apps/diffinery test:     at adminRun (/workspace/diffinery/apps/diffinery/src/lib/quotas.ts:50:26)apps/diffinery test:     at quotasFor (/workspace/diffinery/apps/diffinery/src/lib/quotas.ts:60:13)apps/diffinery test:     at mayStart (/workspace/diffinery/apps/diffinery/src/lib/quotas.ts:191:19)apps/diffinery test:     at Actions.admit (/workspace/diffinery/apps/diffinery/src/repo/actions.ts:1307:25)apps/diffinery test:     at Actions.launch (/workspace/diffinery/apps/diffinery/src/repo/actions.ts:1238:23)apps/diffinery test:     at /workspace/diffinery/apps/diffinery/test/unit/actions-runtime.test.ts:719:41apps/diffinery test:     at async file:///workspace/diffinery/node_modules/.pnpm/@vitest+runner@4.1.11/node_modules/@vitest/runner/dist/chunk-artifact.js:1903:20apps/diffinery test: stderr | test/unit/actions-runtime.test.ts > hosted runner slots > a repository runs at most SHARE hosted jobs at once; the rest wait their turnapps/diffinery test: compute usage failed TypeError: Cannot read properties of undefined (reading 'prepare')apps/diffinery test:     at startCompute (/workspace/diffinery/apps/diffinery/src/lib/quotas.ts:213:16)apps/diffinery test:     at Actions.admit (/workspace/diffinery/apps/diffinery/src/repo/actions.ts:1322:11)apps/diffinery test:     at Actions.launch (/workspace/diffinery/apps/diffinery/src/repo/actions.ts:1238:23)apps/diffinery test:     at /workspace/diffinery/apps/diffinery/test/unit/actions-runtime.test.ts:719:41apps/diffinery test:     at async file:///workspace/diffinery/node_modules/.pnpm/@vitest+runner@4.1.11/node_modules/@vitest/runner/dist/chunk-artifact.js:1903:20apps/diffinery test: stderr | test/unit/actions-runtime.test.ts > hosted runner slots > a repository runs at most SHARE hosted jobs at once; the rest wait their turnapps/diffinery test: kill switch check failed TypeError: Cannot read properties of undefined (reading 'prepare')apps/diffinery test:     at killSwitches (/workspace/diffinery/apps/diffinery/src/lib/killswitch.ts:46:26)apps/diffinery test:     at Actions.blocked (/workspace/diffinery/apps/diffinery/src/repo/actions.ts:2932:30)apps/diffinery test:     at Actions.admit (/workspace/diffinery/apps/diffinery/src/repo/actions.ts:1284:30)apps/diffinery test:     at Actions.launch (/workspace/diffinery/apps/diffinery/src/repo/actions.ts:1238:34)apps/diffinery test:     at launch (/workspace/diffinery/apps/diffinery/test/unit/actions-runtime.test.ts:718:98)apps/diffinery test:     at /workspace/diffinery/apps/diffinery/test/unit/actions-runtime.test.ts:719:47apps/diffinery test:     at async file:///workspace/diffinery/node_modules/.pnpm/@vitest+runner@4.1.11/node_modules/@vitest/runner/dist/chunk-artifact.js:1903:20apps/diffinery test: stderr | test/unit/actions-runtime.test.ts > hosted runner slots > a repository runs at most SHARE hosted jobs at once; the rest wait their turnapps/diffinery test: quota check failed TypeError: Cannot read properties of undefined (reading 'prepare')apps/diffinery test:     at adminRun (/workspace/diffinery/apps/diffinery/src/lib/quotas.ts:50:26)apps/diffinery test:     at quotasFor (/workspace/diffinery/apps/diffinery/src/lib/quotas.ts:60:13)apps/diffinery test:     at mayStart (/workspace/diffinery/apps/diffinery/src/lib/quotas.ts:191:19)apps/diffinery test:     at Actions.admit (/workspace/diffinery/apps/diffinery/src/repo/actions.ts:1307:25)apps/diffinery test:     at Actions.launch (/workspace/diffinery/apps/diffinery/src/repo/actions.ts:1238:23)apps/diffinery test:     at /workspace/diffinery/apps/diffinery/test/unit/actions-runtime.test.ts:719:41apps/diffinery test:     at async file:///workspace/diffinery/node_modules/.pnpm/@vitest+runner@4.1.11/node_modules/@vitest/runner/dist/chunk-artifact.js:1903:20apps/diffinery test: stderr | test/unit/actions-runtime.test.ts > hosted runner slots > a repository runs at most SHARE hosted jobs at once; the rest wait their turnapps/diffinery test: compute usage failed TypeError: Cannot read properties of undefined (reading 'prepare')apps/diffinery test:     at startCompute (/workspace/diffinery/apps/diffinery/src/lib/quotas.ts:213:16)apps/diffinery test:     at Actions.admit (/workspace/diffinery/apps/diffinery/src/repo/actions.ts:1322:11)apps/diffinery test:     at Actions.launch (/workspace/diffinery/apps/diffinery/src/repo/actions.ts:1238:23)apps/diffinery test:     at /workspace/diffinery/apps/diffinery/test/unit/actions-runtime.test.ts:719:41apps/diffinery test:     at async file:///workspace/diffinery/node_modules/.pnpm/@vitest+runner@4.1.11/node_modules/@vitest/runner/dist/chunk-artifact.js:1903:20apps/diffinery test: stderr | test/unit/actions-runtime.test.ts > hosted runner slots > a repository runs at most SHARE hosted jobs at once; the rest wait their turnapps/diffinery test: kill switch check failed TypeError: Cannot read properties of undefined (reading 'prepare')apps/diffinery test:     at killSwitches (/workspace/diffinery/apps/diffinery/src/lib/killswitch.ts:46:26)apps/diffinery test:     at Actions.blocked (/workspace/diffinery/apps/diffinery/src/repo/actions.ts:2932:30)apps/diffinery test:     at Actions.admit (/workspace/diffinery/apps/diffinery/src/repo/actions.ts:1284:30)apps/diffinery test:     at Actions.launch (/workspace/diffinery/apps/diffinery/src/repo/actions.ts:1238:34)apps/diffinery test:     at launch (/workspace/diffinery/apps/diffinery/test/unit/actions-runtime.test.ts:718:98)apps/diffinery test:     at /workspace/diffinery/apps/diffinery/test/unit/actions-runtime.test.ts:719:47apps/diffinery test:     at async file:///workspace/diffinery/node_modules/.pnpm/@vitest+runner@4.1.11/node_modules/@vitest/runner/dist/chunk-artifact.js:1903:20apps/diffinery test: stderr | test/unit/actions-runtime.test.ts > hosted runner slots > a repository runs at most SHARE hosted jobs at once; the rest wait their turnapps/diffinery test: quota check failed TypeError: Cannot read properties of undefined (reading 'prepare')apps/diffinery test:     at adminRun (/workspace/diffinery/apps/diffinery/src/lib/quotas.ts:50:26)apps/diffinery test:     at quotasFor (/workspace/diffinery/apps/diffinery/src/lib/quotas.ts:60:13)apps/diffinery test:     at mayStart (/workspace/diffinery/apps/diffinery/src/lib/quotas.ts:191:19)apps/diffinery test:     at Actions.admit (/workspace/diffinery/apps/diffinery/src/repo/actions.ts:1307:25)apps/diffinery test:     at Actions.launch (/workspace/diffinery/apps/diffinery/src/repo/actions.ts:1238:23)apps/diffinery test:     at /workspace/diffinery/apps/diffinery/test/unit/actions-runtime.test.ts:719:41apps/diffinery test:     at async file:///workspace/diffinery/node_modules/.pnpm/@vitest+runner@4.1.11/node_modules/@vitest/runner/dist/chunk-artifact.js:1903:20apps/diffinery test: stderr | test/unit/actions-runtime.test.ts > hosted runner slots > a repository runs at most SHARE hosted jobs at once; the rest wait their turnapps/diffinery test: compute usage failed TypeError: Cannot read properties of undefined (reading 'prepare')apps/diffinery test:     at startCompute (/workspace/diffinery/apps/diffinery/src/lib/quotas.ts:213:16)apps/diffinery test:     at Actions.admit (/workspace/diffinery/apps/diffinery/src/repo/actions.ts:1322:11)apps/diffinery test:     at Actions.launch (/workspace/diffinery/apps/diffinery/src/repo/actions.ts:1238:23)apps/diffinery test:     at /workspace/diffinery/apps/diffinery/test/unit/actions-runtime.test.ts:719:41apps/diffinery test:     at async file:///workspace/diffinery/node_modules/.pnpm/@vitest+runner@4.1.11/node_modules/@vitest/runner/dist/chunk-artifact.js:1903:20apps/diffinery test: stderr | test/unit/actions-runtime.test.ts > hosted runner slots > a repository runs at most SHARE hosted jobs at once; the rest wait their turnapps/diffinery test: kill switch check failed TypeError: Cannot read properties of undefined (reading 'prepare')apps/diffinery test:     at killSwitches (/workspace/diffinery/apps/diffinery/src/lib/killswitch.ts:46:26)apps/diffinery test:     at Actions.blocked (/workspace/diffinery/apps/diffinery/src/repo/actions.ts:2932:30)apps/diffinery test:     at Actions.admit (/workspace/diffinery/apps/diffinery/src/repo/actions.ts:1284:30)apps/diffinery test:     at Actions.launch (/workspace/diffinery/apps/diffinery/src/repo/actions.ts:1238:34)apps/diffinery test:     at launch (/workspace/diffinery/apps/diffinery/test/unit/actions-runtime.test.ts:718:98)apps/diffinery test:     at /workspace/diffinery/apps/diffinery/test/unit/actions-runtime.test.ts:719:47apps/diffinery test:     at async file:///workspace/diffinery/node_modules/.pnpm/@vitest+runner@4.1.11/node_modules/@vitest/runner/dist/chunk-artifact.js:1903:20apps/diffinery test: stderr | test/unit/actions-runtime.test.ts > hosted runner slots > a repository runs at most SHARE hosted jobs at once; the rest wait their turnapps/diffinery test: quota check failed TypeError: Cannot read properties of undefined (reading 'prepare')apps/diffinery test:     at adminRun (/workspace/diffinery/apps/diffinery/src/lib/quotas.ts:50:26)apps/diffinery test:     at quotasFor (/workspace/diffinery/apps/diffinery/src/lib/quotas.ts:60:13)apps/diffinery test:     at mayStart (/workspace/diffinery/apps/diffinery/src/lib/quotas.ts:191:19)apps/diffinery test:     at Actions.admit (/workspace/diffinery/apps/diffinery/src/repo/actions.ts:1307:25)apps/diffinery test:     at Actions.launch (/workspace/diffinery/apps/diffinery/src/repo/actions.ts:1238:23)apps/diffinery test:     at /workspace/diffinery/apps/diffinery/test/unit/actions-runtime.test.ts:719:41apps/diffinery test:     at async file:///workspace/diffinery/node_modules/.pnpm/@vitest+runner@4.1.11/node_modules/@vitest/runner/dist/chunk-artifact.js:1903:20apps/diffinery test: stderr | test/unit/actions-runtime.test.ts > hosted runner slots > a repository runs at most SHARE hosted jobs at once; the rest wait their turnapps/diffinery test: compute usage failed TypeError: Cannot read properties of undefined (reading 'prepare')apps/diffinery test:     at startCompute (/workspace/diffinery/apps/diffinery/src/lib/quotas.ts:213:16)apps/diffinery test:     at Actions.admit (/workspace/diffinery/apps/diffinery/src/repo/actions.ts:1322:11)apps/diffinery test:     at Actions.launch (/workspace/diffinery/apps/diffinery/src/repo/actions.ts:1238:23)apps/diffinery test:     at /workspace/diffinery/apps/diffinery/test/unit/actions-runtime.test.ts:719:41apps/diffinery test:     at async file:///workspace/diffinery/node_modules/.pnpm/@vitest+runner@4.1.11/node_modules/@vitest/runner/dist/chunk-artifact.js:1903:20apps/diffinery test: stderr | test/unit/actions-runtime.test.ts > hosted runner slots > a repository runs at most SHARE hosted jobs at once; the rest wait their turnapps/diffinery test: kill switch check failed TypeError: Cannot read properties of undefined (reading 'prepare')apps/diffinery test:     at killSwitches (/workspace/diffinery/apps/diffinery/src/lib/killswitch.ts:46:26)apps/diffinery test:     at Actions.blocked (/workspace/diffinery/apps/diffinery/src/repo/actions.ts:2932:30)apps/diffinery test:     at Actions.admit (/workspace/diffinery/apps/diffinery/src/repo/actions.ts:1284:30)apps/diffinery test:     at Actions.launch (/workspace/diffinery/apps/diffinery/src/repo/actions.ts:1238:34)apps/diffinery test:     at launch (/workspace/diffinery/apps/diffinery/test/unit/actions-runtime.test.ts:718:98)apps/diffinery test:     at /workspace/diffinery/apps/diffinery/test/unit/actions-runtime.test.ts:719:47apps/diffinery test:     at async file:///workspace/diffinery/node_modules/.pnpm/@vitest+runner@4.1.11/node_modules/@vitest/runner/dist/chunk-artifact.js:1903:20apps/diffinery test: stderr | test/unit/actions-runtime.test.ts > hosted runner slots > a repository runs at most SHARE hosted jobs at once; the rest wait their turnapps/diffinery test: quota check failed TypeError: Cannot read properties of undefined (reading 'prepare')apps/diffinery test:     at adminRun (/workspace/diffinery/apps/diffinery/src/lib/quotas.ts:50:26)apps/diffinery test:     at quotasFor (/workspace/diffinery/apps/diffinery/src/lib/quotas.ts:60:13)apps/diffinery test:     at mayStart (/workspace/diffinery/apps/diffinery/src/lib/quotas.ts:191:19)apps/diffinery test:     at Actions.admit (/workspace/diffinery/apps/diffinery/src/repo/actions.ts:1307:25)apps/diffinery test:     at Actions.launch (/workspace/diffinery/apps/diffinery/src/repo/actions.ts:1238:23)apps/diffinery test:     at /workspace/diffinery/apps/diffinery/test/unit/actions-runtime.test.ts:719:41apps/diffinery test:     at async file:///workspace/diffinery/node_modules/.pnpm/@vitest+runner@4.1.11/node_modules/@vitest/runner/dist/chunk-artifact.js:1903:20apps/diffinery test: stderr | test/unit/actions-runtime.test.ts > hosted runner slots > a repository runs at most SHARE hosted jobs at once; the rest wait their turnapps/diffinery test: compute usage failed TypeError: Cannot read properties of undefined (reading 'prepare')apps/diffinery test:     at startCompute (/workspace/diffinery/apps/diffinery/src/lib/quotas.ts:213:16)apps/diffinery test:     at Actions.admit (/workspace/diffinery/apps/diffinery/src/repo/actions.ts:1322:11)apps/diffinery test:     at Actions.launch (/workspace/diffinery/apps/diffinery/src/repo/actions.ts:1238:23)apps/diffinery test:     at /workspace/diffinery/apps/diffinery/test/unit/actions-runtime.test.ts:719:41apps/diffinery test:     at async file:///workspace/diffinery/node_modules/.pnpm/@vitest+runner@4.1.11/node_modules/@vitest/runner/dist/chunk-artifact.js:1903:20apps/diffinery test: stderr | test/unit/actions-runtime.test.ts > hosted runner slots > a repository runs at most SHARE hosted jobs at once; the rest wait their turnapps/diffinery test: kill switch check failed TypeError: Cannot read properties of undefined (reading 'prepare')apps/diffinery test:     at killSwitches (/workspace/diffinery/apps/diffinery/src/lib/killswitch.ts:46:26)apps/diffinery test:     at Actions.blocked (/workspace/diffinery/apps/diffinery/src/repo/actions.ts:2932:30)apps/diffinery test:     at Actions.admit (/workspace/diffinery/apps/diffinery/src/repo/actions.ts:1284:30)apps/diffinery test:     at Actions.launch (/workspace/diffinery/apps/diffinery/src/repo/actions.ts:1238:34)apps/diffinery test:     at launch (/workspace/diffinery/apps/diffinery/test/unit/actions-runtime.test.ts:718:98)apps/diffinery test:     at /workspace/diffinery/apps/diffinery/test/unit/actions-runtime.test.ts:719:47apps/diffinery test:     at async file:///workspace/diffinery/node_modules/.pnpm/@vitest+runner@4.1.11/node_modules/@vitest/runner/dist/chunk-artifact.js:1903:20apps/diffinery test: stderr | test/unit/actions-runtime.test.ts > hosted runner slots > a repository runs at most SHARE hosted jobs at once; the rest wait their turnapps/diffinery test: quota check failed TypeError: Cannot read properties of undefined (reading 'prepare')apps/diffinery test:     at adminRun (/workspace/diffinery/apps/diffinery/src/lib/quotas.ts:50:26)apps/diffinery test:     at quotasFor (/workspace/diffinery/apps/diffinery/src/lib/quotas.ts:60:13)apps/diffinery test:     at mayStart (/workspace/diffinery/apps/diffinery/src/lib/quotas.ts:191:19)apps/diffinery test:     at Actions.admit (/workspace/diffinery/apps/diffinery/src/repo/actions.ts:1307:25)apps/diffinery test:     at Actions.launch (/workspace/diffinery/apps/diffinery/src/repo/actions.ts:1238:23)apps/diffinery test:     at /workspace/diffinery/apps/diffinery/test/unit/actions-runtime.test.ts:719:41apps/diffinery test:     at async file:///workspace/diffinery/node_modules/.pnpm/@vitest+runner@4.1.11/node_modules/@vitest/runner/dist/chunk-artifact.js:1903:20apps/diffinery test: stderr | test/unit/actions-runtime.test.ts > hosted runner slots > a repository runs at most SHARE hosted jobs at once; the rest wait their turnapps/diffinery test: compute usage failed TypeError: Cannot read properties of undefined (reading 'prepare')apps/diffinery test:     at startCompute (/workspace/diffinery/apps/diffinery/src/lib/quotas.ts:213:16)apps/diffinery test:     at Actions.admit (/workspace/diffinery/apps/diffinery/src/repo/actions.ts:1322:11)apps/diffinery test:     at Actions.launch (/workspace/diffinery/apps/diffinery/src/repo/actions.ts:1238:23)apps/diffinery test:     at /workspace/diffinery/apps/diffinery/test/unit/actions-runtime.test.ts:719:41apps/diffinery test:     at async file:///workspace/diffinery/node_modules/.pnpm/@vitest+runner@4.1.11/node_modules/@vitest/runner/dist/chunk-artifact.js:1903:20apps/diffinery test: stderr | test/unit/actions-runtime.test.ts > hosted runner slots > a repository runs at most SHARE hosted jobs at once; the rest wait their turnapps/diffinery test: kill switch check failed TypeError: Cannot read properties of undefined (reading 'prepare')apps/diffinery test:     at killSwitches (/workspace/diffinery/apps/diffinery/src/lib/killswitch.ts:46:26)apps/diffinery test:     at Actions.blocked (/workspace/diffinery/apps/diffinery/src/repo/actions.ts:2932:30)apps/diffinery test:     at Actions.admit (/workspace/diffinery/apps/diffinery/src/repo/actions.ts:1284:30)apps/diffinery test:     at Actions.launch (/workspace/diffinery/apps/diffinery/src/repo/actions.ts:1238:34)apps/diffinery test:     at launch (/workspace/diffinery/apps/diffinery/test/unit/actions-runtime.test.ts:718:98)apps/diffinery test:     at /workspace/diffinery/apps/diffinery/test/unit/actions-runtime.test.ts:719:47apps/diffinery test:     at async file:///workspace/diffinery/node_modules/.pnpm/@vitest+runner@4.1.11/node_modules/@vitest/runner/dist/chunk-artifact.js:1903:20apps/diffinery test: stderr | test/unit/actions-runtime.test.ts > hosted runner slots > a repository runs at most SHARE hosted jobs at once; the rest wait their turnapps/diffinery test: quota check failed TypeError: Cannot read properties of undefined (reading 'prepare')apps/diffinery test:     at adminRun (/workspace/diffinery/apps/diffinery/src/lib/quotas.ts:50:26)apps/diffinery test:     at quotasFor (/workspace/diffinery/apps/diffinery/src/lib/quotas.ts:60:13)apps/diffinery test:     at mayStart (/workspace/diffinery/apps/diffinery/src/lib/quotas.ts:191:19)apps/diffinery test:     at Actions.admit (/workspace/diffinery/apps/diffinery/src/repo/actions.ts:1307:25)apps/diffinery test:     at Actions.launch (/workspace/diffinery/apps/diffinery/src/repo/actions.ts:1238:23)apps/diffinery test:     at /workspace/diffinery/apps/diffinery/test/unit/actions-runtime.test.ts:719:41apps/diffinery test:     at async file:///workspace/diffinery/node_modules/.pnpm/@vitest+runner@4.1.11/node_modules/@vitest/runner/dist/chunk-artifact.js:1903:20apps/diffinery test: stderr | test/unit/actions-runtime.test.ts > hosted runner slots > a repository runs at most SHARE hosted jobs at once; the rest wait their turnapps/diffinery test: compute usage failed TypeError: Cannot read properties of undefined (reading 'prepare')apps/diffinery test:     at startCompute (/workspace/diffinery/apps/diffinery/src/lib/quotas.ts:213:16)apps/diffinery test:     at Actions.admit (/workspace/diffinery/apps/diffinery/src/repo/actions.ts:1322:11)apps/diffinery test:     at Actions.launch (/workspace/diffinery/apps/diffinery/src/repo/actions.ts:1238:23)apps/diffinery test:     at /workspace/diffinery/apps/diffinery/test/unit/actions-runtime.test.ts:719:41apps/diffinery test:     at async file:///workspace/diffinery/node_modules/.pnpm/@vitest+runner@4.1.11/node_modules/@vitest/runner/dist/chunk-artifact.js:1903:20apps/diffinery test: stderr | test/unit/actions-runtime.test.ts > hosted runner slots > a repository runs at most SHARE hosted jobs at once; the rest wait their turnapps/diffinery test: kill switch check failed TypeError: Cannot read properties of undefined (reading 'prepare')apps/diffinery test:     at killSwitches (/workspace/diffinery/apps/diffinery/src/lib/killswitch.ts:46:26)apps/diffinery test:     at Actions.blocked (/workspace/diffinery/apps/diffinery/src/repo/actions.ts:2932:30)apps/diffinery test:     at Actions.admit (/workspace/diffinery/apps/diffinery/src/repo/actions.ts:1284:30)apps/diffinery test:     at Actions.launch (/workspace/diffinery/apps/diffinery/src/repo/actions.ts:1238:34)apps/diffinery test:     at launch (/workspace/diffinery/apps/diffinery/test/unit/actions-runtime.test.ts:718:98)apps/diffinery test:     at /workspace/diffinery/apps/diffinery/test/unit/actions-runtime.test.ts:719:47apps/diffinery test:     at async file:///workspace/diffinery/node_modules/.pnpm/@vitest+runner@4.1.11/node_modules/@vitest/runner/dist/chunk-artifact.js:1903:20apps/diffinery test: stderr | test/unit/actions-runtime.test.ts > hosted runner slots > a repository runs at most SHARE hosted jobs at once; the rest wait their turnapps/diffinery test: quota check failed TypeError: Cannot read properties of undefined (reading 'prepare')apps/diffinery test:     at adminRun (/workspace/diffinery/apps/diffinery/src/lib/quotas.ts:50:26)apps/diffinery test:     at quotasFor (/workspace/diffinery/apps/diffinery/src/lib/quotas.ts:60:13)apps/diffinery test:     at mayStart (/workspace/diffinery/apps/diffinery/src/lib/quotas.ts:191:19)apps/diffinery test:     at Actions.admit (/workspace/diffinery/apps/diffinery/src/repo/actions.ts:1307:25)apps/diffinery test:     at Actions.launch (/workspace/diffinery/apps/diffinery/src/repo/actions.ts:1238:23)apps/diffinery test:     at /workspace/diffinery/apps/diffinery/test/unit/actions-runtime.test.ts:719:41apps/diffinery test:     at async file:///workspace/diffinery/node_modules/.pnpm/@vitest+runner@4.1.11/node_modules/@vitest/runner/dist/chunk-artifact.js:1903:20apps/diffinery test: stderr | test/unit/actions-runtime.test.ts > hosted runner slots > a repository runs at most SHARE hosted jobs at once; the rest wait their turnapps/diffinery test: compute usage failed TypeError: Cannot read properties of undefined (reading 'prepare')apps/diffinery test:     at startCompute (/workspace/diffinery/apps/diffinery/src/lib/quotas.ts:213:16)apps/diffinery test:     at Actions.admit (/workspace/diffinery/apps/diffinery/src/repo/actions.ts:1322:11)apps/diffinery test:     at Actions.launch (/workspace/diffinery/apps/diffinery/src/repo/actions.ts:1238:23)apps/diffinery test:     at /workspace/diffinery/apps/diffinery/test/unit/actions-runtime.test.ts:719:41apps/diffinery test:     at async file:///workspace/diffinery/node_modules/.pnpm/@vitest+runner@4.1.11/node_modules/@vitest/runner/dist/chunk-artifact.js:1903:20apps/diffinery test: stderr | test/unit/actions-runtime.test.ts > hosted runner slots > a repository runs at most SHARE hosted jobs at once; the rest wait their turnapps/diffinery test: kill switch check failed TypeError: Cannot read properties of undefined (reading 'prepare')apps/diffinery test:     at killSwitches (/workspace/diffinery/apps/diffinery/src/lib/killswitch.ts:46:26)apps/diffinery test:     at Actions.blocked (/workspace/diffinery/apps/diffinery/src/repo/actions.ts:2932:30)apps/diffinery test:     at Actions.admit (/workspace/diffinery/apps/diffinery/src/repo/actions.ts:1284:30)apps/diffinery test:     at Actions.launch (/workspace/diffinery/apps/diffinery/src/repo/actions.ts:1238:34)apps/diffinery test:     at launch (/workspace/diffinery/apps/diffinery/test/unit/actions-runtime.test.ts:718:98)apps/diffinery test:     at /workspace/diffinery/apps/diffinery/test/unit/actions-runtime.test.ts:719:47apps/diffinery test:     at async file:///workspace/diffinery/node_modules/.pnpm/@vitest+runner@4.1.11/node_modules/@vitest/runner/dist/chunk-artifact.js:1903:20apps/diffinery test: stderr | test/unit/actions-runtime.test.ts > hosted runner slots > a repository runs at most SHARE hosted jobs at once; the rest wait their turnapps/diffinery test: quota check failed TypeError: Cannot read properties of undefined (reading 'prepare')apps/diffinery test:     at adminRun (/workspace/diffinery/apps/diffinery/src/lib/quotas.ts:50:26)apps/diffinery test:     at quotasFor (/workspace/diffinery/apps/diffinery/src/lib/quotas.ts:60:13)apps/diffinery test:     at mayStart (/workspace/diffinery/apps/diffinery/src/lib/quotas.ts:191:19)apps/diffinery test:     at Actions.admit (/workspace/diffinery/apps/diffinery/src/repo/actions.ts:1307:25)apps/diffinery test:     at Actions.launch (/workspace/diffinery/apps/diffinery/src/repo/actions.ts:1238:23)apps/diffinery test:     at /workspace/diffinery/apps/diffinery/test/unit/actions-runtime.test.ts:719:41apps/diffinery test:     at async file:///workspace/diffinery/node_modules/.pnpm/@vitest+runner@4.1.11/node_modules/@vitest/runner/dist/chunk-artifact.js:1903:20apps/diffinery test: stderr | test/unit/actions-runtime.test.ts > hosted runner slots > a repository runs at most SHARE hosted jobs at once; the rest wait their turnapps/diffinery test: compute usage failed TypeError: Cannot read properties of undefined (reading 'prepare')apps/diffinery test:     at startCompute (/workspace/diffinery/apps/diffinery/src/lib/quotas.ts:213:16)apps/diffinery test:     at Actions.admit (/workspace/diffinery/apps/diffinery/src/repo/actions.ts:1322:11)apps/diffinery test:     at Actions.launch (/workspace/diffinery/apps/diffinery/src/repo/actions.ts:1238:23)apps/diffinery test:     at /workspace/diffinery/apps/diffinery/test/unit/actions-runtime.test.ts:719:41apps/diffinery test:     at async file:///workspace/diffinery/node_modules/.pnpm/@vitest+runner@4.1.11/node_modules/@vitest/runner/dist/chunk-artifact.js:1903:20apps/diffinery test: stderr | test/unit/actions-runtime.test.ts > hosted runner slots > a repository runs at most SHARE hosted jobs at once; the rest wait their turnapps/diffinery test: kill switch check failed TypeError: Cannot read properties of undefined (reading 'prepare')apps/diffinery test:     at killSwitches (/workspace/diffinery/apps/diffinery/src/lib/killswitch.ts:46:26)apps/diffinery test:     at Actions.blocked (/workspace/diffinery/apps/diffinery/src/repo/actions.ts:2932:30)apps/diffinery test:     at Actions.admit (/workspace/diffinery/apps/diffinery/src/repo/actions.ts:1284:30)apps/diffinery test:     at Actions.launch (/workspace/diffinery/apps/diffinery/src/repo/actions.ts:1238:34)apps/diffinery test:     at launch (/workspace/diffinery/apps/diffinery/test/unit/actions-runtime.test.ts:718:98)apps/diffinery test:     at /workspace/diffinery/apps/diffinery/test/unit/actions-runtime.test.ts:719:47apps/diffinery test:     at async file:///workspace/diffinery/node_modules/.pnpm/@vitest+runner@4.1.11/node_modules/@vitest/runner/dist/chunk-artifact.js:1903:20apps/diffinery test: stderr | test/unit/actions-runtime.test.ts > hosted runner slots > a repository runs at most SHARE hosted jobs at once; the rest wait their turnapps/diffinery test: quota check failed TypeError: Cannot read properties of undefined (reading 'prepare')apps/diffinery test:     at adminRun (/workspace/diffinery/apps/diffinery/src/lib/quotas.ts:50:26)apps/diffinery test:     at quotasFor (/workspace/diffinery/apps/diffinery/src/lib/quotas.ts:60:13)apps/diffinery test:     at mayStart (/workspace/diffinery/apps/diffinery/src/lib/quotas.ts:191:19)apps/diffinery test:     at Actions.admit (/workspace/diffinery/apps/diffinery/src/repo/actions.ts:1307:25)apps/diffinery test:     at Actions.launch (/workspace/diffinery/apps/diffinery/src/repo/actions.ts:1238:23)apps/diffinery test:     at /workspace/diffinery/apps/diffinery/test/unit/actions-runtime.test.ts:719:41apps/diffinery test:     at async file:///workspace/diffinery/node_modules/.pnpm/@vitest+runner@4.1.11/node_modules/@vitest/runner/dist/chunk-artifact.js:1903:20apps/diffinery test: stderr | test/unit/actions-runtime.test.ts > hosted runner slots > a repository runs at most SHARE hosted jobs at once; the rest wait their turnapps/diffinery test: compute usage failed TypeError: Cannot read properties of undefined (reading 'prepare')apps/diffinery test:     at startCompute (/workspace/diffinery/apps/diffinery/src/lib/quotas.ts:213:16)apps/diffinery test:     at Actions.admit (/workspace/diffinery/apps/diffinery/src/repo/actions.ts:1322:11)apps/diffinery test:     at Actions.launch (/workspace/diffinery/apps/diffinery/src/repo/actions.ts:1238:23)apps/diffinery test:     at /workspace/diffinery/apps/diffinery/test/unit/actions-runtime.test.ts:719:41apps/diffinery test:     at async file:///workspace/diffinery/node_modules/.pnpm/@vitest+runner@4.1.11/node_modules/@vitest/runner/dist/chunk-artifact.js:1903:20apps/diffinery test: stderr | test/unit/actions-runtime.test.ts > hosted runner slots > a repository runs at most SHARE hosted jobs at once; the rest wait their turnapps/diffinery test: kill switch check failed TypeError: Cannot read properties of undefined (reading 'prepare')apps/diffinery test:     at killSwitches (/workspace/diffinery/apps/diffinery/src/lib/killswitch.ts:46:26)apps/diffinery test:     at Actions.blocked (/workspace/diffinery/apps/diffinery/src/repo/actions.ts:2932:30)apps/diffinery test:     at Actions.admit (/workspace/diffinery/apps/diffinery/src/repo/actions.ts:1284:30)apps/diffinery test:     at Actions.launch (/workspace/diffinery/apps/diffinery/src/repo/actions.ts:1238:34)apps/diffinery test:     at launch (/workspace/diffinery/apps/diffinery/test/unit/actions-runtime.test.ts:718:98)apps/diffinery test:     at /workspace/diffinery/apps/diffinery/test/unit/actions-runtime.test.ts:719:47apps/diffinery test:     at async file:///workspace/diffinery/node_modules/.pnpm/@vitest+runner@4.1.11/node_modules/@vitest/runner/dist/chunk-artifact.js:1903:20apps/diffinery test: stderr | test/unit/actions-runtime.test.ts > hosted runner slots > a repository runs at most SHARE hosted jobs at once; the rest wait their turnapps/diffinery test: quota check failed TypeError: Cannot read properties of undefined (reading 'prepare')apps/diffinery test:     at adminRun (/workspace/diffinery/apps/diffinery/src/lib/quotas.ts:50:26)apps/diffinery test:     at quotasFor (/workspace/diffinery/apps/diffinery/src/lib/quotas.ts:60:13)apps/diffinery test:     at mayStart (/workspace/diffinery/apps/diffinery/src/lib/quotas.ts:191:19)apps/diffinery test:     at Actions.admit (/workspace/diffinery/apps/diffinery/src/repo/actions.ts:1307:25)apps/diffinery test:     at Actions.launch (/workspace/diffinery/apps/diffinery/src/repo/actions.ts:1238:23)apps/diffinery test:     at /workspace/diffinery/apps/diffinery/test/unit/actions-runtime.test.ts:719:41apps/diffinery test:     at async file:///workspace/diffinery/node_modules/.pnpm/@vitest+runner@4.1.11/node_modules/@vitest/runner/dist/chunk-artifact.js:1903:20apps/diffinery test: stderr | test/unit/actions-runtime.test.ts > hosted runner slots > a repository runs at most SHARE hosted jobs at once; the rest wait their turnapps/diffinery test: compute usage failed TypeError: Cannot read properties of undefined (reading 'prepare')apps/diffinery test:     at startCompute (/workspace/diffinery/apps/diffinery/src/lib/quotas.ts:213:16)apps/diffinery test:     at Actions.admit (/workspace/diffinery/apps/diffinery/src/repo/actions.ts:1322:11)apps/diffinery test:     at Actions.launch (/workspace/diffinery/apps/diffinery/src/repo/actions.ts:1238:23)apps/diffinery test:     at /workspace/diffinery/apps/diffinery/test/unit/actions-runtime.test.ts:719:41apps/diffinery test:     at async file:///workspace/diffinery/node_modules/.pnpm/@vitest+runner@4.1.11/node_modules/@vitest/runner/dist/chunk-artifact.js:1903:20apps/diffinery test: stderr | test/unit/actions-runtime.test.ts > hosted runner slots > a repository runs at most SHARE hosted jobs at once; the rest wait their turnapps/diffinery test: kill switch check failed TypeError: Cannot read properties of undefined (reading 'prepare')apps/diffinery test:     at killSwitches (/workspace/diffinery/apps/diffinery/src/lib/killswitch.ts:46:26)apps/diffinery test:     at Actions.blocked (/workspace/diffinery/apps/diffinery/src/repo/actions.ts:2932:30)apps/diffinery test:     at Actions.admit (/workspace/diffinery/apps/diffinery/src/repo/actions.ts:1284:30)apps/diffinery test:     at Actions.launch (/workspace/diffinery/apps/diffinery/src/repo/actions.ts:1238:34)apps/diffinery test:     at launch (/workspace/diffinery/apps/diffinery/test/unit/actions-runtime.test.ts:718:98)apps/diffinery test:     at /workspace/diffinery/apps/diffinery/test/unit/actions-runtime.test.ts:719:47apps/diffinery test:     at async file:///workspace/diffinery/node_modules/.pnpm/@vitest+runner@4.1.11/node_modules/@vitest/runner/dist/chunk-artifact.js:1903:20apps/diffinery test: stderr | test/unit/actions-runtime.test.ts > hosted runner slots > a repository runs at most SHARE hosted jobs at once; the rest wait their turnapps/diffinery test: quota check failed TypeError: Cannot read properties of undefined (reading 'prepare')apps/diffinery test:     at adminRun (/workspace/diffinery/apps/diffinery/src/lib/quotas.ts:50:26)apps/diffinery test:     at quotasFor (/workspace/diffinery/apps/diffinery/src/lib/quotas.ts:60:13)apps/diffinery test:     at mayStart (/workspace/diffinery/apps/diffinery/src/lib/quotas.ts:191:19)apps/diffinery test:     at Actions.admit (/workspace/diffinery/apps/diffinery/src/repo/actions.ts:1307:25)apps/diffinery test:     at Actions.launch (/workspace/diffinery/apps/diffinery/src/repo/actions.ts:1238:23)apps/diffinery test:     at /workspace/diffinery/apps/diffinery/test/unit/actions-runtime.test.ts:719:41apps/diffinery test:     at async file:///workspace/diffinery/node_modules/.pnpm/@vitest+runner@4.1.11/node_modules/@vitest/runner/dist/chunk-artifact.js:1903:20apps/diffinery test: stderr | test/unit/actions-runtime.test.ts > hosted runner slots > a repository runs at most SHARE hosted jobs at once; the rest wait their turnapps/diffinery test: compute usage failed TypeError: Cannot read properties of undefined (reading 'prepare')apps/diffinery test:     at startCompute (/workspace/diffinery/apps/diffinery/src/lib/quotas.ts:213:16)apps/diffinery test:     at Actions.admit (/workspace/diffinery/apps/diffinery/src/repo/actions.ts:1322:11)apps/diffinery test:     at Actions.launch (/workspace/diffinery/apps/diffinery/src/repo/actions.ts:1238:23)apps/diffinery test:     at /workspace/diffinery/apps/diffinery/test/unit/actions-runtime.test.ts:719:41apps/diffinery test:     at async file:///workspace/diffinery/node_modules/.pnpm/@vitest+runner@4.1.11/node_modules/@vitest/runner/dist/chunk-artifact.js:1903:20apps/diffinery test: stderr | test/unit/actions-runtime.test.ts > hosted runner slots > a repository runs at most SHARE hosted jobs at once; the rest wait their turnapps/diffinery test: kill switch check failed TypeError: Cannot read properties of undefined (reading 'prepare')apps/diffinery test:     at killSwitches (/workspace/diffinery/apps/diffinery/src/lib/killswitch.ts:46:26)apps/diffinery test:     at Actions.blocked (/workspace/diffinery/apps/diffinery/src/repo/actions.ts:2932:30)apps/diffinery test:     at Actions.admit (/workspace/diffinery/apps/diffinery/src/repo/actions.ts:1284:30)apps/diffinery test:     at Actions.launch (/workspace/diffinery/apps/diffinery/src/repo/actions.ts:1238:34)apps/diffinery test:     at launch (/workspace/diffinery/apps/diffinery/test/unit/actions-runtime.test.ts:718:98)apps/diffinery test:     at /workspace/diffinery/apps/diffinery/test/unit/actions-runtime.test.ts:719:47apps/diffinery test:     at async file:///workspace/diffinery/node_modules/.pnpm/@vitest+runner@4.1.11/node_modules/@vitest/runner/dist/chunk-artifact.js:1903:20apps/diffinery test: stderr | test/unit/actions-runtime.test.ts > hosted runner slots > a repository runs at most SHARE hosted jobs at once; the rest wait their turnapps/diffinery test: quota check failed TypeError: Cannot read properties of undefined (reading 'prepare')apps/diffinery test:     at adminRun (/workspace/diffinery/apps/diffinery/src/lib/quotas.ts:50:26)apps/diffinery test:     at quotasFor (/workspace/diffinery/apps/diffinery/src/lib/quotas.ts:60:13)apps/diffinery test:     at mayStart (/workspace/diffinery/apps/diffinery/src/lib/quotas.ts:191:19)apps/diffinery test:     at Actions.admit (/workspace/diffinery/apps/diffinery/src/repo/actions.ts:1307:25)apps/diffinery test:     at Actions.launch (/workspace/diffinery/apps/diffinery/src/repo/actions.ts:1238:23)apps/diffinery test:     at /workspace/diffinery/apps/diffinery/test/unit/actions-runtime.test.ts:719:41apps/diffinery test:     at async file:///workspace/diffinery/node_modules/.pnpm/@vitest+runner@4.1.11/node_modules/@vitest/runner/dist/chunk-artifact.js:1903:20apps/diffinery test: stderr | test/unit/actions-runtime.test.ts > hosted runner slots > a repository runs at most SHARE hosted jobs at once; the rest wait their turnapps/diffinery test: compute usage failed TypeError: Cannot read properties of undefined (reading 'prepare')apps/diffinery test:     at startCompute (/workspace/diffinery/apps/diffinery/src/lib/quotas.ts:213:16)apps/diffinery test:     at Actions.admit (/workspace/diffinery/apps/diffinery/src/repo/actions.ts:1322:11)apps/diffinery test:     at Actions.launch (/workspace/diffinery/apps/diffinery/src/repo/actions.ts:1238:23)apps/diffinery test:     at /workspace/diffinery/apps/diffinery/test/unit/actions-runtime.test.ts:719:41apps/diffinery test:     at async file:///workspace/diffinery/node_modules/.pnpm/@vitest+runner@4.1.11/node_modules/@vitest/runner/dist/chunk-artifact.js:1903:20apps/diffinery test: stderr | test/unit/actions-runtime.test.ts > hosted runner slots > a repository runs at most SHARE hosted jobs at once; the rest wait their turnapps/diffinery test: kill switch check failed TypeError: Cannot read properties of undefined (reading 'prepare')apps/diffinery test:     at killSwitches (/workspace/diffinery/apps/diffinery/src/lib/killswitch.ts:46:26)apps/diffinery test:     at Actions.blocked (/workspace/diffinery/apps/diffinery/src/repo/actions.ts:2932:30)apps/diffinery test:     at Actions.admit (/workspace/diffinery/apps/diffinery/src/repo/actions.ts:1284:30)apps/diffinery test:     at Actions.launch (/workspace/diffinery/apps/diffinery/src/repo/actions.ts:1238:34)apps/diffinery test:     at launch (/workspace/diffinery/apps/diffinery/test/unit/actions-runtime.test.ts:718:98)apps/diffinery test:     at /workspace/diffinery/apps/diffinery/test/unit/actions-runtime.test.ts:719:47apps/diffinery test:     at async file:///workspace/diffinery/node_modules/.pnpm/@vitest+runner@4.1.11/node_modules/@vitest/runner/dist/chunk-artifact.js:1903:20apps/diffinery test: stderr | test/unit/actions-runtime.test.ts > hosted runner slots > a repository runs at most SHARE hosted jobs at once; the rest wait their turnapps/diffinery test: kill switch check failed TypeError: Cannot read properties of undefined (reading 'prepare')apps/diffinery test:     at killSwitches (/workspace/diffinery/apps/diffinery/src/lib/killswitch.ts:46:26)apps/diffinery test:     at Actions.blocked (/workspace/diffinery/apps/diffinery/src/repo/actions.ts:2932:30)apps/diffinery test:     at Actions.admit (/workspace/diffinery/apps/diffinery/src/repo/actions.ts:1284:30)apps/diffinery test:     at Actions.launch (/workspace/diffinery/apps/diffinery/src/repo/actions.ts:1238:34)apps/diffinery test:     at launch (/workspace/diffinery/apps/diffinery/test/unit/actions-runtime.test.ts:718:98)apps/diffinery test:     at /workspace/diffinery/apps/diffinery/test/unit/actions-runtime.test.ts:719:47apps/diffinery test:     at async file:///workspace/diffinery/node_modules/.pnpm/@vitest+runner@4.1.11/node_modules/@vitest/runner/dist/chunk-artifact.js:1903:20apps/diffinery test: stderr | test/unit/actions-runtime.test.ts > hosted runner slots > a repository runs at most SHARE hosted jobs at once; the rest wait their turnapps/diffinery test: compute usage failed TypeError: Cannot read properties of undefined (reading 'prepare')apps/diffinery test:     at endCompute (/workspace/diffinery/apps/diffinery/src/lib/quotas.ts:218:16)apps/diffinery test:     at Actions.completeJob (/workspace/diffinery/apps/diffinery/src/repo/actions.ts:2623:13)apps/diffinery test:     at /workspace/diffinery/apps/diffinery/test/unit/actions-runtime.test.ts:724:5apps/diffinery test:     at async file:///workspace/diffinery/node_modules/.pnpm/@vitest+runner@4.1.11/node_modules/@vitest/runner/dist/chunk-artifact.js:1903:20apps/diffinery test: stderr | test/unit/actions-runtime.test.ts > hosted runner slots > a repository runs at most SHARE hosted jobs at once; the rest wait their turnapps/diffinery test: kill switch check failed TypeError: Cannot read properties of undefined (reading 'prepare')apps/diffinery test:     at killSwitches (/workspace/diffinery/apps/diffinery/src/lib/killswitch.ts:46:26)apps/diffinery test:     at Actions.blocked (/workspace/diffinery/apps/diffinery/src/repo/actions.ts:2932:30)apps/diffinery test:     at Actions.admit (/workspace/diffinery/apps/diffinery/src/repo/actions.ts:1284:30)apps/diffinery test:     at Actions.launch (/workspace/diffinery/apps/diffinery/src/repo/actions.ts:1238:34)apps/diffinery test:     at Actions.completeJob (/workspace/diffinery/apps/diffinery/src/repo/actions.ts:2625:28)apps/diffinery test:     at /workspace/diffinery/apps/diffinery/test/unit/actions-runtime.test.ts:724:5apps/diffinery test:     at async file:///workspace/diffinery/node_modules/.pnpm/@vitest+runner@4.1.11/node_modules/@vitest/runner/dist/chunk-artifact.js:1903:20apps/diffinery test: stderr | test/unit/actions-runtime.test.ts > hosted runner slots > a repository runs at most SHARE hosted jobs at once; the rest wait their turnapps/diffinery test: quota check failed TypeError: Cannot read properties of undefined (reading 'prepare')apps/diffinery test:     at adminRun (/workspace/diffinery/apps/diffinery/src/lib/quotas.ts:50:26)apps/diffinery test:     at quotasFor (/workspace/diffinery/apps/diffinery/src/lib/quotas.ts:60:13)apps/diffinery test:     at mayStart (/workspace/diffinery/apps/diffinery/src/lib/quotas.ts:191:19)apps/diffinery test:     at Actions.admit (/workspace/diffinery/apps/diffinery/src/repo/actions.ts:1307:25)apps/diffinery test:     at Actions.launch (/workspace/diffinery/apps/diffinery/src/repo/actions.ts:1238:23)apps/diffinery test:     at Actions.completeJob (/workspace/diffinery/apps/diffinery/src/repo/actions.ts:2625:17)apps/diffinery test:     at /workspace/diffinery/apps/diffinery/test/unit/actions-runtime.test.ts:724:5apps/diffinery test:     at async file:///workspace/diffinery/node_modules/.pnpm/@vitest+runner@4.1.11/node_modules/@vitest/runner/dist/chunk-artifact.js:1903:20apps/diffinery test: stderr | test/unit/actions-runtime.test.ts > hosted runner slots > a repository runs at most SHARE hosted jobs at once; the rest wait their turnapps/diffinery test: compute usage failed TypeError: Cannot read properties of undefined (reading 'prepare')apps/diffinery test:     at startCompute (/workspace/diffinery/apps/diffinery/src/lib/quotas.ts:213:16)apps/diffinery test:     at Actions.admit (/workspace/diffinery/apps/diffinery/src/repo/actions.ts:1322:11)apps/diffinery test:     at Actions.launch (/workspace/diffinery/apps/diffinery/src/repo/actions.ts:1238:23)apps/diffinery test:     at Actions.completeJob (/workspace/diffinery/apps/diffinery/src/repo/actions.ts:2625:17)apps/diffinery test:     at /workspace/diffinery/apps/diffinery/test/unit/actions-runtime.test.ts:724:5apps/diffinery test:     at async file:///workspace/diffinery/node_modules/.pnpm/@vitest+runner@4.1.11/node_modules/@vitest/runner/dist/chunk-artifact.js:1903:20apps/diffinery test:  ✓ test/unit/camo.test.ts (20 tests) 111msapps/diffinery test: stderr | test/unit/actions-runtime.test.ts > hosted runner slots > a running job whose runner froze is ended at its timeout plus JOB_DEADLINE_GRACE_MS, and a healthy one is left aloneapps/diffinery test: compute usage failed TypeError: Cannot read properties of undefined (reading 'prepare')apps/diffinery test:     at endCompute (/workspace/diffinery/apps/diffinery/src/lib/quotas.ts:218:16)apps/diffinery test:     at Actions.completeJob (/workspace/diffinery/apps/diffinery/src/repo/actions.ts:2623:13)apps/diffinery test:     at Actions.enforceJobDeadlines (/workspace/diffinery/apps/diffinery/src/repo/actions.ts:1879:7)apps/diffinery test:     at /workspace/diffinery/apps/diffinery/test/unit/actions-runtime.test.ts:1014:5apps/diffinery test:     at async file:///workspace/diffinery/node_modules/.pnpm/@vitest+runner@4.1.11/node_modules/@vitest/runner/dist/chunk-artifact.js:1903:20apps/diffinery test: stderr | test/unit/actions-runtime.test.ts > hosted runner slots > a running job whose runner froze is ended at its timeout plus JOB_DEADLINE_GRACE_MS, and a healthy one is left aloneapps/diffinery test: compute usage failed TypeError: Cannot read properties of undefined (reading 'prepare')apps/diffinery test:     at endCompute (/workspace/diffinery/apps/diffinery/src/lib/quotas.ts:218:16)apps/diffinery test:     at Actions.completeJob (/workspace/diffinery/apps/diffinery/src/repo/actions.ts:2623:13)apps/diffinery test:     at Actions.enforceJobDeadlines (/workspace/diffinery/apps/diffinery/src/repo/actions.ts:1879:7)apps/diffinery test:     at /workspace/diffinery/apps/diffinery/test/unit/actions-runtime.test.ts:1014:5apps/diffinery test:     at async file:///workspace/diffinery/node_modules/.pnpm/@vitest+runner@4.1.11/node_modules/@vitest/runner/dist/chunk-artifact.js:1903:20apps/diffinery test: stderr | test/unit/actions-runtime.test.ts > hosted runner slots > a running job whose runner froze is ended at its timeout plus JOB_DEADLINE_GRACE_MS, and a healthy one is left aloneapps/diffinery test: compute usage failed TypeError: Cannot read properties of undefined (reading 'prepare')apps/diffinery test:     at endCompute (/workspace/diffinery/apps/diffinery/src/lib/quotas.ts:218:16)apps/diffinery test:     at Actions.completeJob (/workspace/diffinery/apps/diffinery/src/repo/actions.ts:2623:13)apps/diffinery test:     at Actions.enforceJobDeadlines (/workspace/diffinery/apps/diffinery/src/repo/actions.ts:1879:7)apps/diffinery test:     at /workspace/diffinery/apps/diffinery/test/unit/actions-runtime.test.ts:1025:5apps/diffinery test:     at async file:///workspace/diffinery/node_modules/.pnpm/@vitest+runner@4.1.11/node_modules/@vitest/runner/dist/chunk-artifact.js:1903:20apps/diffinery test: stderr | test/unit/actions-runtime.test.ts > hosted runner slots > a running job whose runner froze is ended at its timeout plus JOB_DEADLINE_GRACE_MS, and a healthy one is left aloneapps/diffinery test: compute usage failed TypeError: Cannot read properties of undefined (reading 'prepare')apps/diffinery test:     at endCompute (/workspace/diffinery/apps/diffinery/src/lib/quotas.ts:218:16)apps/diffinery test:     at Actions.completeJob (/workspace/diffinery/apps/diffinery/src/repo/actions.ts:2623:13)apps/diffinery test:     at Actions.enforceJobDeadlines (/workspace/diffinery/apps/diffinery/src/repo/actions.ts:1879:7)apps/diffinery test:     at /workspace/diffinery/apps/diffinery/test/unit/actions-runtime.test.ts:1027:5apps/diffinery test:     at async file:///workspace/diffinery/node_modules/.pnpm/@vitest+runner@4.1.11/node_modules/@vitest/runner/dist/chunk-artifact.js:1903:20apps/diffinery test: stderr | test/unit/actions-runtime.test.ts > hosted runner slots > cancelling a run lets running hosted jobs run their steps that run after a cancel, and ends them after CANCEL_STOP_MSapps/diffinery test: compute usage failed TypeError: Cannot read properties of undefined (reading 'prepare')apps/diffinery test:     at endCompute (/workspace/diffinery/apps/diffinery/src/lib/quotas.ts:218:16)apps/diffinery test:     at Actions.completeJob (/workspace/diffinery/apps/diffinery/src/repo/actions.ts:2623:13)apps/diffinery test:     at Actions.cancelInternal (/workspace/diffinery/apps/diffinery/src/repo/actions.ts:2127:7)apps/diffinery test:     at Actions.cancel (/workspace/diffinery/apps/diffinery/src/repo/actions.ts:2133:5)apps/diffinery test:     at /workspace/diffinery/apps/diffinery/test/unit/actions-runtime.test.ts:1072:5apps/diffinery test:     at async file:///workspace/diffinery/node_modules/.pnpm/@vitest+runner@4.1.11/node_modules/@vitest/runner/dist/chunk-artifact.js:1903:20apps/diffinery test: stderr | test/unit/actions-runtime.test.ts > hosted runner slots > cancelling a run lets running hosted jobs run their steps that run after a cancel, and ends them after CANCEL_STOP_MSapps/diffinery test: compute usage failed TypeError: Cannot read properties of undefined (reading 'prepare')apps/diffinery test:     at endCompute (/workspace/diffinery/apps/diffinery/src/lib/quotas.ts:218:16)apps/diffinery test:     at Actions.completeJob (/workspace/diffinery/apps/diffinery/src/repo/actions.ts:2623:13)apps/diffinery test:     at Actions.cancelInternal (/workspace/diffinery/apps/diffinery/src/repo/actions.ts:2127:7)apps/diffinery test:     at Actions.cancel (/workspace/diffinery/apps/diffinery/src/repo/actions.ts:2133:5)apps/diffinery test:     at /workspace/diffinery/apps/diffinery/test/unit/actions-runtime.test.ts:1072:5apps/diffinery test:     at async file:///workspace/diffinery/node_modules/.pnpm/@vitest+runner@4.1.11/node_modules/@vitest/runner/dist/chunk-artifact.js:1903:20apps/diffinery test: stderr | test/unit/actions-runtime.test.ts > hosted runner slots > cancelling a run lets running hosted jobs run their steps that run after a cancel, and ends them after CANCEL_STOP_MSapps/diffinery test: compute usage failed TypeError: Cannot read properties of undefined (reading 'prepare')apps/diffinery test:     at endCompute (/workspace/diffinery/apps/diffinery/src/lib/quotas.ts:218:16)apps/diffinery test:     at Actions.completeJob (/workspace/diffinery/apps/diffinery/src/repo/actions.ts:2623:13)apps/diffinery test:     at /workspace/diffinery/apps/diffinery/test/unit/actions-runtime.test.ts:1082:5apps/diffinery test:     at async file:///workspace/diffinery/node_modules/.pnpm/@vitest+runner@4.1.11/node_modules/@vitest/runner/dist/chunk-artifact.js:1903:20apps/diffinery test: stderr | test/unit/actions-runtime.test.ts > hosted runner slots > cancelling a cancelled run again stops its jobs at once, and a cancelled job whose container stops before its runner reports ends as cancelledapps/diffinery test: compute usage failed TypeError: Cannot read properties of undefined (reading 'prepare')apps/diffinery test:     at endCompute (/workspace/diffinery/apps/diffinery/src/lib/quotas.ts:218:16)apps/diffinery test:     at Actions.completeJob (/workspace/diffinery/apps/diffinery/src/repo/actions.ts:2623:13)apps/diffinery test:     at Actions.cancelInternal (/workspace/diffinery/apps/diffinery/src/repo/actions.ts:2127:7)apps/diffinery test:     at Actions.cancel (/workspace/diffinery/apps/diffinery/src/repo/actions.ts:2133:5)apps/diffinery test:     at /workspace/diffinery/apps/diffinery/test/unit/actions-runtime.test.ts:1124:5apps/diffinery test:     at async file:///workspace/diffinery/node_modules/.pnpm/@vitest+runner@4.1.11/node_modules/@vitest/runner/dist/chunk-artifact.js:1903:20apps/diffinery test: stderr | test/unit/actions-runtime.test.ts > hosted runner slots > cancelling a cancelled run again stops its jobs at once, and a cancelled job whose container stops before its runner reports ends as cancelledapps/diffinery test: compute usage failed TypeError: Cannot read properties of undefined (reading 'prepare')apps/diffinery test:     at endCompute (/workspace/diffinery/apps/diffinery/src/lib/quotas.ts:218:16)apps/diffinery test:     at Actions.completeJob (/workspace/diffinery/apps/diffinery/src/repo/actions.ts:2623:13)apps/diffinery test:     at /workspace/diffinery/apps/diffinery/test/unit/actions-runtime.test.ts:1128:5apps/diffinery test:     at async file:///workspace/diffinery/node_modules/.pnpm/@vitest+runner@4.1.11/node_modules/@vitest/runner/dist/chunk-artifact.js:1903:20apps/diffinery test: stderr | test/unit/actions-runtime.test.ts > unfinished runs > past MAX_ACTIVE_RUNS a dispatch is refused and other events start nothingapps/diffinery test: kill switch check failed TypeError: Cannot read properties of undefined (reading 'prepare')apps/diffinery test:     at killSwitches (/workspace/diffinery/apps/diffinery/src/lib/killswitch.ts:46:26)apps/diffinery test:     at Actions.blocked (/workspace/diffinery/apps/diffinery/src/repo/actions.ts:2932:30)apps/diffinery test:     at Actions.createRun (/workspace/diffinery/apps/diffinery/src/repo/actions.ts:737:30)apps/diffinery test:     at /workspace/diffinery/apps/diffinery/test/unit/actions-runtime.test.ts:1342:26apps/diffinery test:     at file:///workspace/diffinery/node_modules/.pnpm/@vitest+runner@4.1.11/node_modules/@vitest/runner/dist/chunk-artifact.js:302:11apps/diffinery test:     at file:///workspace/diffinery/node_modules/.pnpm/@vitest+runner@4.1.11/node_modules/@vitest/runner/dist/chunk-artifact.js:1903:26apps/diffinery test:     at file:///workspace/diffinery/node_modules/.pnpm/@vitest+runner@4.1.11/node_modules/@vitest/runner/dist/chunk-artifact.js:2326:20apps/diffinery test:     at new Promise (<anonymous>)apps/diffinery test:     at runWithCancel (file:///workspace/diffinery/node_modules/.pnpm/@vitest+runner@4.1.11/node_modules/@vitest/runner/dist/chunk-artifact.js:2323:10)apps/diffinery test:     at file:///workspace/diffinery/node_modules/.pnpm/@vitest+runner@4.1.11/node_modules/@vitest/runner/dist/chunk-artifact.js:2305:20apps/diffinery test: stderr | test/unit/actions-runtime.test.ts > unfinished runs > past MAX_ACTIVE_RUNS a dispatch is refused and other events start nothingapps/diffinery test: kill switch check failed TypeError: Cannot read properties of undefined (reading 'prepare')apps/diffinery test:     at killSwitches (/workspace/diffinery/apps/diffinery/src/lib/killswitch.ts:46:26)apps/diffinery test:     at Actions.blocked (/workspace/diffinery/apps/diffinery/src/repo/actions.ts:2932:30)apps/diffinery test:     at Actions.createRun (/workspace/diffinery/apps/diffinery/src/repo/actions.ts:737:30)apps/diffinery test:     at /workspace/diffinery/apps/diffinery/test/unit/actions-runtime.test.ts:1343:26apps/diffinery test:     at async file:///workspace/diffinery/node_modules/.pnpm/@vitest+runner@4.1.11/node_modules/@vitest/runner/dist/chunk-artifact.js:1903:20apps/diffinery test: stderr | test/unit/actions-runtime.test.ts > unfinished runs > past MAX_ACTIVE_RUNS a dispatch is refused and other events start nothingapps/diffinery test: not starting .github/workflows/w.yml: 500 unfinished runsapps/diffinery test:  ❯ test/unit/actions-runtime.test.ts (40 tests | 1 failed) 5232msapps/diffinery test:      ✓ carries what the toolkit and buildkit read, and verifies only under the right key 13msapps/diffinery test:      ✓ rejects expired tokens and tampered claims 1msapps/diffinery test:      ✓ grant one permission on one blob until they expire 11msapps/diffinery test:      ✓ parses Azure block lists in order 1msapps/diffinery test:      ✓ parses byte ranges like Azure and HTTP 1msapps/diffinery test:      ✓ keeps staged objects per blob, and transient data outside repos/ 1msapps/diffinery test:      ✓ handles empty and single uploads 73msapps/diffinery test:      ✓ streams a few blocks into one object 191msapps/diffinery test:      ✓ writes large uploads as equal multipart parts, cutting across blocks  535msapps/diffinery test:      ✓ copies a large upload as multipart parts spread over many steps, not one long put  1921msapps/diffinery test:      ✓ fails a step whose staged block went missing, instead of writing a short part 7msapps/diffinery test:      ✓ merges many small blocks in rounds so that no step exceeds its calls 153msapps/diffinery test:      ✓ keeps a 50,000-block list (Azure's maximum) within the Workers subrequest limit  1472msapps/diffinery test:      ✓ removes every object under its prefixes, a page at a time, and nothing else 18msapps/diffinery test:      ✓ stores small bodies in one put and large ones as parts, a part in memory at a time 42msapps/diffinery test:      ✓ refuses more than the limit and stores nothing 22msapps/diffinery test:      ✓ adds repository, sender and organization like GitHub 1msapps/diffinery test:      ✓ completes pull_request with head.repo and keeps trigger fields 1msapps/diffinery test:      ✓ builds issue and release objects 1msapps/diffinery test:      ✓ restores from the job's own ref, then the default branch; never another branch's 30msapps/diffinery test:      ✓ gives pull requests their base branch's caches but not other pull requests' 25msapps/diffinery test:      ✓ honours retention-days, clamped to 1..90 days 24msapps/diffinery test:      ✓ deletes an expired artifact's content and lists it as expired 29msapps/diffinery test:      ✓ a job starting again from the beginning drops what its stopped attempt uploaded, and nothing else 29msapps/diffinery test:      ✓ are listed with numeric ids, and can be read and deleted like the others 26msapps/diffinery test:      ✓ expire like the others 29msapps/diffinery test:      ✓ share names with the artifact service's uploads, which don't list them 24msapps/diffinery test:      ✓ recorded before they were listed are moved over, keeping their age 25msapps/diffinery test:      ✓ audit each change, marking those made through the API 3msapps/diffinery test:      ✓ drops entries unused for a week, with their objects 20msapps/diffinery test:      ✓ a repository runs at most SHARE hosted jobs at once; the rest wait their turn 131msapps/diffinery test:      ✓ a job whose container gets no machine waits and starts again, and fails only after MAX_PLACEMENT_TRIES 49msapps/diffinery test:      ✓ a matrix leg back in line after getting no machine waits out its pause when a sibling finishes 44msapps/diffinery test:      ✓ a hosted runner on an image other than the deployed one is turned away and the job starts again every STALE_IMAGE_RETRY_SECONDS, up to STALE_IMAGE_TRIES 88msapps/diffinery test:      ✓ a running job whose runner froze is ended at its timeout plus JOB_DEADLINE_GRACE_MS, and a healthy one is left alone 23msapps/diffinery test:      × cancelling a run lets running hosted jobs run their steps that run after a cancel, and ends them after CANCEL_STOP_MS 36msapps/diffinery test:      ✓ cancelling a cancelled run again stops its jobs at once, and a cancelled job whose container stops before its runner reports ends as cancelled 28msapps/diffinery test:      ✓ a job whose runner a rollout replaced starts again on a new runner before its steps ran or when it can only read, and fails otherwise 65msapps/diffinery test:      ✓ keeps only the runner's short image, location and instance strings 1msapps/diffinery test:      ✓ past MAX_ACTIVE_RUNS a dispatch is refused and other events start nothing 29msapps/diffinery test: (node:1165) ExperimentalWarning: SQLite is an experimental feature and might change at any timeapps/diffinery test: (Use `node --trace-warnings ...` to show where the warning was created)containers/runner test: [diffinery-runner] log upload failed: POST http://127.0.0.1:46175/runner/jobs/job-1/logs -> 503 {"error":"try later"}apps/diffinery test:  ✓ test/unit/quotas.test.ts (9 tests) 202mscontainers/runner test: [diffinery-runner] log upload failed: POST http://127.0.0.1:46175/runner/jobs/job-1/logs -> 503 {"error":"try later"}apps/diffinery test: stdout | test/unit/image.test.ts > decode → crop → resize → encode > turns a landscape photo into small square WebPs of the centreapps/diffinery test: avatar WebP bytes (1200×800 synthetic photo): { '64': 1040, '128': 2154, '256': 7042 }apps/diffinery test: stderr | test/unit/image.test.ts > decode → crop → resize → encode > rejects what it cannot or should not handleapps/diffinery test: Corrupt JPEG data: 83 extraneous bytes before marker 0x24apps/diffinery test: Unsupported marker type 0x24apps/diffinery test:  ✓ test/unit/image.test.ts (11 tests) 2098msapps/diffinery test:      ✓ box-filters by an integer factor, keeping at least the minimum  338msapps/diffinery test:      ✓ turns a landscape photo into small square WebPs of the centre  602msapps/diffinery test:      ✓ keeps transparency from a PNG and accepts WebP input  899msapps/diffinery test: (node:1320) ExperimentalWarning: SQLite is an experimental feature and might change at any timeapps/diffinery test: (Use `node --trace-warnings ...` to show where the warning was created)apps/diffinery test:  ✓ test/unit/digest.test.ts (16 tests) 96msapps/diffinery test:  ✓ test/unit/email.test.ts (91 tests) 75msapps/diffinery test: (node:1528) ExperimentalWarning: SQLite is an experimental feature and might change at any timeapps/diffinery test: (Use `node --trace-warnings ...` to show where the warning was created)apps/diffinery test:  ✓ test/unit/deploy-turnstile.test.ts (12 tests) 4291msapps/diffinery test:      ✓ creates the widget when there is none, and prints its site key  2340msapps/diffinery test:      ✓ reuses the widget it finds by name, and leaves a secret that goes with it alone  325msapps/diffinery test:      ✓ replaces a TURNSTILE_SECRET that goes with another site key before the deploy  441msapps/diffinery test:  ✓ test/unit/docs.test.ts (174 tests) 5594msapps/diffinery test:      ✓ api: links and anchors resolve  2902msapps/diffinery test:      ✓ serves every page as HTML and as Markdown  1709msapps/diffinery test: (node:1749) ExperimentalWarning: SQLite is an experimental feature and might change at any timeapps/diffinery test: (Use `node --trace-warnings ...` to show where the warning was created)apps/diffinery test: stderr | test/unit/signup.test.ts > Turnstile > asks siteverify with the secret, the token and the visitor's IP, and trusts only successapps/diffinery test: turnstile siteverify failed Error: network downapps/diffinery test:     at /workspace/diffinery/apps/diffinery/test/unit/signup.test.ts:73:13apps/diffinery test:     at verifyTurnstile (/workspace/diffinery/apps/diffinery/src/auth/signup.ts:47:21)apps/diffinery test:     at /workspace/diffinery/apps/diffinery/test/unit/signup.test.ts:75:18apps/diffinery test:     at process.processTicksAndRejections (node:internal/process/task_queues:105:5)apps/diffinery test:     at async file:///workspace/diffinery/node_modules/.pnpm/@vitest+runner@4.1.11/node_modules/@vitest/runner/dist/chunk-artifact.js:1903:20apps/diffinery test:  ✓ test/unit/signup.test.ts (12 tests) 80msapps/diffinery test:  ✓ test/unit/storage.test.ts (8 tests) 2064msapps/diffinery test:      ✓ compresses a large object a chunk at a time to store it, to the same zlib data  876msapps/diffinery test:      ✓ gives a thin pack's bases only when reading them fits, saying what they would take otherwise  391msapps/diffinery test: (node:1813) ExperimentalWarning: SQLite is an experimental feature and might change at any timeapps/diffinery test: (Use `node --trace-warnings ...` to show where the warning was created)apps/diffinery test:  ✓ test/unit/site.test.ts (41 tests) 205msapps/diffinery test: (node:1820) ExperimentalWarning: SQLite is an experimental feature and might change at any timeapps/diffinery test: (Use `node --trace-warnings ...` to show where the warning was created)apps/diffinery test: stderr | test/unit/webhooks.test.ts > webhook secrets > can't be moved to another hookapps/diffinery test: webhook secret unreadable c58fc2f146e44815a1c443b1d554e3c1 the secret doesn't decrypt with MASTER_KEYapps/diffinery test:  ✓ test/unit/security-reports.test.ts (6 tests) 90msapps/diffinery test:  ✓ test/unit/webhooks.test.ts (11 tests) 208msapps/diffinery test: (node:1869) ExperimentalWarning: SQLite is an experimental feature and might change at any timeapps/diffinery test: (Use `node --trace-warnings ...` to show where the warning was created)apps/diffinery test:  ✓ test/unit/launch.test.ts (3 tests) 330msapps/diffinery test:  ✓ test/unit/oauth.test.ts (9 tests) 11msapps/diffinery test: (node:2289) ExperimentalWarning: SQLite is an experimental feature and might change at any timeapps/diffinery test: (Use `node --trace-warnings ...` to show where the warning was created)apps/diffinery test: (node:1892) ExperimentalWarning: SQLite is an experimental feature and might change at any timeapps/diffinery test: (Use `node --trace-warnings ...` to show where the warning was created)apps/diffinery test: stderr | test/unit/recovery.test.ts > account recovery by email > signs out every other browser, keeps access tokens, and says soapps/diffinery test: mail queue not bound; dropping 1 email(s)apps/diffinery test: stderr | test/unit/recovery.test.ts > account recovery by email > keeps the other browsers when someone already signed in confirms it's themapps/diffinery test: mail queue not bound; dropping 1 email(s)apps/diffinery test:  ✓ test/unit/recovery.test.ts (2 tests) 140msapps/diffinery test:  ✓ test/unit/egress.test.ts (3 tests) 230msapps/diffinery test:  ✓ test/unit/search-query.test.ts (10 tests) 9msapps/diffinery test:  ✓ test/unit/archive.test.ts (3 tests) 120msapps/diffinery test:  ✓ test/unit/r2-sink.test.ts (5 tests) 74msapps/diffinery test: (node:2530) ExperimentalWarning: SQLite is an experimental feature and might change at any timeapps/diffinery test: (Use `node --trace-warnings ...` to show where the warning was created)apps/diffinery test: (node:2542) ExperimentalWarning: SQLite is an experimental feature and might change at any timeapps/diffinery test: (Use `node --trace-warnings ...` to show where the warning was created)apps/diffinery test: stderr | test/unit/server-errors.test.ts > server errors > a 5xx answer carries a request id that finds its record; other answers aren't recordedapps/diffinery test: Error: D1_ERROR: storage operation exceeded timeout, using dfy_abcdefghijklmnopapps/diffinery test:     at Array.<anonymous> (/workspace/diffinery/apps/diffinery/test/unit/server-errors.test.ts:25:13)apps/diffinery test:     at #dispatch (file:///workspace/diffinery/node_modules/.pnpm/hono@4.13.13/node_modules/hono/dist/hono-base.js:276:34)apps/diffinery test:     at Hono.fetch (file:///workspace/diffinery/node_modules/.pnpm/hono@4.13.13/node_modules/hono/dist/hono-base.js:307:24)apps/diffinery test:     at Hono.request (file:///workspace/diffinery/node_modules/.pnpm/hono@4.13.13/node_modules/hono/dist/hono-base.js:324:15)apps/diffinery test:     at /workspace/diffinery/apps/diffinery/test/unit/server-errors.test.ts:34:27apps/diffinery test:     at file:///workspace/diffinery/node_modules/.pnpm/@vitest+runner@4.1.11/node_modules/@vitest/runner/dist/chunk-artifact.js:302:11apps/diffinery test:     at file:///workspace/diffinery/node_modules/.pnpm/@vitest+runner@4.1.11/node_modules/@vitest/runner/dist/chunk-artifact.js:1903:26apps/diffinery test:     at file:///workspace/diffinery/node_modules/.pnpm/@vitest+runner@4.1.11/node_modules/@vitest/runner/dist/chunk-artifact.js:2326:20apps/diffinery test:     at new Promise (<anonymous>)apps/diffinery test:     at runWithCancel (file:///workspace/diffinery/node_modules/.pnpm/@vitest+runner@4.1.11/node_modules/@vitest/runner/dist/chunk-artifact.js:2323:10)apps/diffinery test: stderr | test/unit/server-errors.test.ts > server errors > a 5xx answer carries a request id that finds its record; other answers aren't recordedapps/diffinery test: Error: boomapps/diffinery test:     at Array.<anonymous> (/workspace/diffinery/apps/diffinery/test/unit/server-errors.test.ts:28:13)apps/diffinery test:     at #dispatch (file:///workspace/diffinery/node_modules/.pnpm/hono@4.13.13/node_modules/hono/dist/hono-base.js:276:34)apps/diffinery test:     at Hono.fetch (file:///workspace/diffinery/node_modules/.pnpm/hono@4.13.13/node_modules/hono/dist/hono-base.js:307:24)apps/diffinery test:     at Hono.request (file:///workspace/diffinery/node_modules/.pnpm/hono@4.13.13/node_modules/hono/dist/hono-base.js:324:15)apps/diffinery test:     at /workspace/diffinery/apps/diffinery/test/unit/server-errors.test.ts:39:23apps/diffinery test:     at process.processTicksAndRejections (node:internal/process/task_queues:105:5)apps/diffinery test:     at async file:///workspace/diffinery/node_modules/.pnpm/@vitest+runner@4.1.11/node_modules/@vitest/runner/dist/chunk-artifact.js:1903:20apps/diffinery test:  ✓ test/unit/project-endrun.test.ts (3 tests) 89msapps/diffinery test:  ✓ test/unit/server-errors.test.ts (3 tests) 140msapps/diffinery test:  ✓ test/unit/release-notes.test.ts (5 tests) 17msapps/diffinery test:  ✓ test/unit/schedules.test.ts (7 tests) 30msapps/diffinery test: (node:2604) ExperimentalWarning: SQLite is an experimental feature and might change at any timeapps/diffinery test: (Use `node --trace-warnings ...` to show where the warning was created)apps/diffinery test:  ✓ test/unit/retention.test.ts (2 tests) 56msapps/diffinery test: stderr | test/unit/mail-batches.test.ts > queueing email in batches the queue accepts > leaves out a job too large for one queue message, not the batch it would be inapps/diffinery test: email too large to queue; dropped thread 200322apps/diffinery test: stderr | test/unit/mail-batches.test.ts > queueing email in batches the queue accepts > queues every batch even when one is refusedapps/diffinery test: could not queue email 50 Error: refusedapps/diffinery test:     at Object.sendBatch (/workspace/diffinery/apps/diffinery/test/unit/mail-batches.test.ts:34:89)apps/diffinery test:     at enqueueMail (/workspace/diffinery/apps/diffinery/src/mail/send.ts:70:22)apps/diffinery test:     at /workspace/diffinery/apps/diffinery/test/unit/mail-batches.test.ts:35:11apps/diffinery test:     at file:///workspace/diffinery/node_modules/.pnpm/@vitest+runner@4.1.11/node_modules/@vitest/runner/dist/chunk-artifact.js:302:11apps/diffinery test:     at file:///workspace/diffinery/node_modules/.pnpm/@vitest+runner@4.1.11/node_modules/@vitest/runner/dist/chunk-artifact.js:1903:26apps/diffinery test:     at file:///workspace/diffinery/node_modules/.pnpm/@vitest+runner@4.1.11/node_modules/@vitest/runner/dist/chunk-artifact.js:2326:20apps/diffinery test:     at new Promise (<anonymous>)apps/diffinery test:     at runWithCancel (file:///workspace/diffinery/node_modules/.pnpm/@vitest+runner@4.1.11/node_modules/@vitest/runner/dist/chunk-artifact.js:2323:10)apps/diffinery test:     at file:///workspace/diffinery/node_modules/.pnpm/@vitest+runner@4.1.11/node_modules/@vitest/runner/dist/chunk-artifact.js:2305:20apps/diffinery test:     at new Promise (<anonymous>)apps/diffinery test:  ✓ test/unit/mail-batches.test.ts (4 tests) 53msapps/diffinery test:  ✓ test/unit/webhook-payload.test.ts (3 tests) 5msapps/diffinery test:  ✓ test/unit/avatars.test.ts (3 tests) 6msapps/diffinery test: stdout | test/unit/highlight.test.ts > tokens > highlights a 1,500-line TypeScript file quicklyapps/diffinery test: highlight: 1,500-line TypeScript file in 575 msapps/diffinery test:  ✓ test/unit/commit-log.test.ts (2 tests) 707msapps/diffinery test:      ✓ lists nothing past MAX_LOG_DEPTH and never walks further than it  697msapps/diffinery test: (node:2661) ExperimentalWarning: SQLite is an experimental feature and might change at any timeapps/diffinery test: (Use `node --trace-warnings ...` to show where the warning was created)apps/diffinery test:  ✓ test/unit/audit-retention.test.ts (2 tests) 38msapps/diffinery test:  ✓ test/unit/dev-auth.test.ts (2 tests) 5msapps/diffinery test:  ✓ test/unit/highlight.test.ts (13 tests) 5910msapps/diffinery test:      ✓ loads every grammar on the JavaScript regex engine  4594msapps/diffinery test:      ✓ highlights a 1,500-line TypeScript file quickly  577msapps/diffinery test:      ✓ match Shiki's own dual-theme output  417msapps/diffinery test:  ✓ test/unit/search-fanout.test.ts (1 test) 3msapps/diffinery test: ⎯⎯⎯⎯⎯⎯⎯ Failed Tests 1 ⎯⎯⎯⎯⎯⎯⎯apps/diffinery test:  FAIL  test/unit/actions-runtime.test.ts > hosted runner slots > cancelling a run lets running hosted jobs run their steps that run after a cancel, and ends them after CANCEL_STOP_MSapps/diffinery test: AssertionError: expected [ 'job-w', false ] to deeply equal [ 'job-b', false ]apps/diffinery test: - Expectedapps/diffinery test: + Receivedapps/diffinery test:   [apps/diffinery test: -   "job-b",apps/diffinery test: +   "job-w",apps/diffinery test:     false,apps/diffinery test:   ]apps/diffinery test:  ❯ test/unit/actions-runtime.test.ts:1089:28apps/diffinery test:     1087|     expect(job("b").status).toBe("in_progress");apps/diffinery test:     1088|     await actions.enforceJobDeadlines(deadline);apps/diffinery test:     1089|     expect(stopped.at(-1)).toEqual(["job-b", false]);apps/diffinery test:        |                            ^apps/diffinery test:     1090|     expect(job("b").conclusion).toBe("cancelled");apps/diffinery test:     1091|     expect(JSON.parse(job("b").failure!).message).toBe(`Cancelled by o…apps/diffinery test: ⎯⎯⎯⎯⎯⎯⎯⎯⎯⎯⎯⎯⎯⎯⎯⎯⎯⎯⎯⎯⎯⎯⎯⎯[1/1]⎯apps/diffinery test:  Test Files  1 failed | 39 passed (40)apps/diffinery test:       Tests  1 failed | 669 passed (670)apps/diffinery test:    Start at  14:09:08apps/diffinery test:    Duration  17.94s (transform 8.17s, setup 0ms, import 16.85s, tests 30.15s, environment 4ms)apps/diffinery test: ::error file=/workspace/diffinery/apps/diffinery/test/unit/actions-runtime.test.ts,title=test/unit/actions-runtime.test.ts > hosted runner slots > cancelling a run lets running hosted jobs run their steps that run after a cancel%2C and ends them after CANCEL_STOP_MS,line=1089,column=28::AssertionError: expected [ 'job-w', false ] to deeply equal [ 'job-b', false ]%0A%0A- Expected%0A+ Received%0A%0A  [%0A-   "job-b",%0A+   "job-w",%0A    false,%0A  ]%0A%0A ❯ test/unit/actions-runtime.test.ts:1089:28%0A%0Aapps/diffinery test: Failed/workspace/diffinery/apps/diffinery: ERR_PNPM_RECURSIVE_RUN_FIRST_FAIL  @diffinery/app@0.1.0 test: `vitest run --passWithNoTests --exclude 'test/e2e/**' --shard=2/2`Exit status 1##[error]Process completed with exit code 1.
Post Run pnpm/action-setup@b906affcce14559ad1aafd4ab0e942779e9f58b10s
Pruning is unnecessary.
Post Run actions/checkout@v40s
Removing persisted credentials

Job summary

Vitest Test Report

Summary

  • Test Files: ✅ 1 pass · 1 total
  • Test Results: ✅ 4 passes · 4 total

Vitest Test Report

Summary

  • Test Files: ✅ 2 passes · 2 total
  • Test Results: ✅ 95 passes · 95 total

Vitest Test Report

Summary

  • Test Files: ✅ 3 passes · 3 total
  • Test Results: ✅ 30 passes · 30 total

Vitest Test Report

Summary

  • Test Files: ✅ 4 passes · 4 total
  • Test Results: ✅ 34 passes · 34 total

Vitest Test Report

Summary

  • Test Files: ❌ 1 failure · ✅ 39 passes · 40 total
  • Test Results: ❌ 1 failure · ✅ 669 passes · 670 total